program: Gaussian 09
title: 000198861
version: EM64L-G09RevD.01
frameworkgroup: C1[X(C14H21ClN2O3)]
method: RPBEPBE
basis: SDD
operation: Freq
keyword: #p
keyword: freq=noraman
keyword: PBEPBE/SDD
title: #p freq=noraman PBEPBE/SDD
converged: YES YES NO NO
title: Mulliken charges:
elementType: Cl O O O N N C C C C C C C C C C C C C C H H H H H H H H H H H H H H H H H H H H H
charge: -0.072894 -0.296365 -0.321696 -0.435870 -0.092737 -0.344097 -0.359731 -0.327576 -0.325643 -0.404075 -0.696180 -0.672688 0.335007 -0.438232 0.176470 0.199646 -0.321480 -0.307046 -0.243887 -0.067916 0.203264 0.248518 0.206380 0.188029 0.186575 0.201211 0.232588 0.275742 0.250915 0.215769 0.211012 0.213114 0.224478 0.209732 0.308007 0.251283 0.221799 0.246670 0.277385 0.254040 0.390478
chargesum: 0.00000
title: Mulliken charges with hydrogens summed into heavy atoms:
elementType: Cl O O O N N C C C C C C C C C C C C C C
charge: -0.072894 -0.296365 -0.321696 -0.045392 -0.092737 -0.036090 0.092052 0.066832 0.062143 0.104254 -0.018484 -0.025364 0.335007 0.034851 0.176470 0.199646 -0.074810 -0.029661 0.010154 -0.067916
polarizability: 2.89087011e+02 -1.34529003e+01 1.77543555e+02 5.45720878e+00 9.40140176e+00 1.17322051e+02
1716.lowfreq: -6.1305 -0.0008 0.0005 0.0008 4.2235 9.2090 14.9862 22.2061 25.8045
frequency: 14.7552 22.1136 24.9961 33.8282 55.4890 59.7360 66.9888 99.5907 105.4612 115.1568 151.8460 175.2952 205.1448 205.8755 237.4834 248.8874 257.1035 269.4376 285.5368 296.7095 317.1273 323.7982 368.3992 389.2188 402.2995 430.9487 455.5728 472.5282 480.8173 505.7940 565.3467 577.5472 586.4585 615.1638 629.3688 695.1709 709.2451 730.1600 754.2310 770.5795 792.3489 796.1775 805.0700 855.2469 870.0937 888.2264 912.6885 921.1184 923.2187 946.6322 981.3122 989.8194 1026.7607 1059.6625 1061.2644 1070.3351 1075.0349 1082.7461 1090.3772 1096.0673 1124.3398 1158.5225 1180.1704 1206.8136 1211.8259 1224.6775 1246.6244 1251.6230 1267.0344 1288.8732 1289.4267 1314.1070 1320.4074 1326.1058 1351.2848 1358.4824 1365.3703 1383.6140 1385.1755 1388.5051 1395.2846 1443.4225 1445.4505 1448.3212 1465.1472 1466.0732 1472.0127 1474.9419 1477.0949 1484.2340 1491.0868 1499.5317 1511.4047 1569.4715 1592.2131 1616.4063 2830.3730 2849.7133 2857.9524 2956.1009 2978.0931 2981.3476 2986.0313 3010.2632 3020.2642 3037.9961 3040.0679 3046.2107 3078.5077 3079.8675 3086.2530 3092.3681 3112.0540 3153.3101 3182.8227 3185.3971 3547.3875
redmass: 5.2439 4.7870 4.2789 3.0124 6.9456 2.2552 6.0097 2.8109 2.3982 5.2721 2.7132 4.6618 3.8805 6.2607 2.8562 1.4028 4.3927 3.1377 1.6999 2.2627 2.9722 5.2882 5.3411 3.1366 4.8391 3.5321 2.5209 5.1609 3.1922 2.9327 6.3961 4.0608 1.5230 2.8596 5.9566 3.8793 3.6333 3.4226 2.6430 1.5076 1.4546 1.1869 1.1975 1.4221 6.5962 3.2076 1.1006 1.4690 1.7709 7.1266 2.4617 2.3043 3.6499 2.9479 1.9483 2.1362 2.4187 2.6514 1.6882 2.0519 1.7142 1.8646 1.7771 1.3009 2.3482 1.4037 1.8338 2.0612 1.5303 1.2081 1.1793 1.3803 1.6605 1.2263 1.3694 1.3136 1.3356 1.2812 4.6861 1.2511 1.2297 1.2426 1.1474 1.6367 1.0602 1.0570 1.0660 3.1794 1.0794 1.0592 1.0614 1.0762 2.0325 6.2794 6.8004 6.6770 1.0806 1.0717 1.0710 1.0585 1.0565 1.0357 1.0358 1.0972 1.0935 1.0625 1.0871 1.1072 1.0989 1.0982 1.1008 1.1006 1.1053 1.0893 1.0941 1.0951 1.0780
irintensity: 0.1771 1.5449 0.3529 0.0360 1.3849 0.5725 3.5921 2.1130 0.4154 6.4198 6.1692 2.2492 0.9169 0.2431 2.8383 0.2740 4.3927 1.7394 3.1829 1.6256 6.7023 8.2737 16.9146 21.4501 5.5870 4.2036 4.9903 22.4685 12.5084 32.5562 4.5041 48.8402 63.5593 18.6245 5.2769 8.4764 2.7498 9.6766 2.5819 15.1895 30.0425 6.8383 6.9486 78.9919 85.5279 2.7311 136.8594 1.8157 6.0217 34.5559 6.7880 3.0517 16.4363 1.8067 15.0123 25.5657 11.7753 18.8186 37.5934 57.0300 20.6297 111.1317 62.3694 6.8550 37.4448 29.1878 24.7429 54.9700 39.5142 15.4542 3.1463 35.1066 38.6790 9.0895 14.4646 16.1643 2.7207 2.4468 100.0995 24.0066 13.0182 50.4915 23.5422 65.2291 6.4972 6.2152 4.3410 166.3490 6.0893 22.8054 11.0637 15.4263 155.1556 35.5348 364.8791 68.3293 2317.3279 35.2642 186.9569 39.7986 44.9577 21.9703 30.9882 4.6925 34.7937 25.6584 29.9861 17.6608 21.0550 70.5666 36.2698 44.3259 8.2837 5.5895 1.5163 1.2281 27.2840
temp: 298.150 k
press: 1.00000 atm
elementType: 17 8 8 8 7 7 6 6 6 6 6 6 6 6 6 6 6 6 6 6 1 1 1 1 1 1 1 1 1 1 1 1 1 1 1 1 1 1 1 1 1
symmnumber: 1
zpe: 876640.7 jmol-1
zpe.correction: 0.333895 hartree
zpe.thermalcorrener: 0.355607 hartree
zpe.thermalcorrenthalpy: 0.356552 hartree
zpe.thermalcorrgfe: 0.279541 hartree
zpe.sumelectzpe: -1339.757779 hartree
zpe.sumelectthermal: -1339.736066 hartree
zpe.sumelectthermalent: -1339.735122 hartree
zpe.sumelectthermalfe: -1339.812133 hartree
dipole: 6.8531 -5.8025 0.9337
dipole: 9.0280
quadrupole: -135.7438 -116.3433 -129.1754
quadrupole: 3.0500 -2.0647 -4.4648
quadrupole: -8.6563 10.7442 -2.0879 3.0500 -2.0647 -4.4648
hfenergy: -1340.0916739 hartree
pointgroup: C01 [X(C14H21Cl1N2O3)]
dipole: -2.4109507 -2.6080092 -0.0405527 debye
polarizability: 283.0612175|28.6172804|176.2726083|14.3537894|-18.442953|124.6187914 unknown
InChI: InChI=1S/C14H21ClN2O3/c1-3-17(4-2)8-7-16-14(19)10-20-13-6-5-11(15)9-12(13)18/h5-6,9,16,18H,3-4,7-8,10H2,1-2H3
charge 0 multiplicity 1
41 atoms
Cl 6.75388 1.883542 0.330829
O  1.458162 -0.919601 1.123575
O  -0.614903 0.278272 -0.44954
O  1.653058 1.573033 -0.426457
N  -5.009736 -0.21899 0.055575
N  -1.589146 -1.822226 -0.462873
C  -3.710823 -0.805346 0.454175
C  -5.066191 1.26048 0.197424
C  -6.198593 -0.925103 0.602357
C  -2.937005 -1.309053 -0.796528
C  -4.079438 2.000467 -0.725977
C  -7.471165 -0.722669 -0.24358
C  -0.516827 -0.991296 -0.312362
C  0.836179 -1.642017 0.001987
C  2.703686 -0.269267 0.864916
C  2.74746 0.960461 0.134713
C  3.871475 -0.816961 1.430774
C  4.005543 1.602702 -0.021737
C  5.120416 -0.17353 1.283091
C  5.151579 1.028839 0.54722
H  -3.860786 -1.650076 1.157034
H  -3.076264 -0.062293 0.978134
H  -6.092855 1.582523 -0.05254
H  -4.881664 1.567886 1.258853
H  -6.405569 -0.626898 1.662159
H  -5.962125 -2.005989 0.619246
H  -3.509505 -2.107292 -1.29975
H  -2.820285 -0.469475 -1.499694
H  -3.027115 1.742868 -0.508206
H  -4.285884 1.755772 -1.783408
H  -4.187664 3.09292 -0.594217
H  -7.807892 0.329239 -0.245318
H  -7.284283 -1.023659 -1.289329
H  -8.299001 -1.334568 0.160544
H  -1.470447 -2.818604 -0.269843
H  1.476266 -1.597761 -0.900776
H  0.714968 -2.699961 0.304118
H  3.787248 -1.74567 2.004396
H  4.043476 2.542918 -0.576914
H  6.028818 -0.589389 1.724976
H  0.756655 1.074571 -0.327249
