program: Gaussian 09
title: 000017168
version: EM64L-G09RevD.01
frameworkgroup: C1[X(C8H9ClNO5PS)]
method: RPBEPBE
basis: SDD
operation: Freq
keyword: #p
keyword: freq=noraman
keyword: PBEPBE/SDD
title: #p freq=noraman PBEPBE/SDD
converged: YES YES NO NO
title: Mulliken charges:
elementType: Cl S P O O O O O N C C C C C C C C H H H H H H H H H
charge: 0.001694 -0.185857 0.868605 -0.473701 -0.454732 -0.467178 -0.203620 -0.203368 0.020926 0.488165 -0.269938 -0.250950 0.415598 -0.361042 -0.354157 -0.477456 -0.474624 0.284100 0.313076 0.291357 0.250569 0.241891 0.255589 0.251436 0.242169 0.251448
chargesum: 0.00000
title: Mulliken charges with hydrogens summed into heavy atoms:
elementType: Cl S P O O O O O N C C C C C C C C
charge: 0.001694 -0.185857 0.868605 -0.473701 -0.454732 -0.467178 -0.203620 -0.203368 0.020926 0.488165 -0.269938 0.033150 0.415598 -0.047967 -0.062801 0.270593 0.270430
polarizability: 2.36431183e+02 1.16203852e+01 1.76561333e+02 -6.27436670e+00 -1.95668960e-01 1.10796692e+02
1716.lowfreq: -7.4607 -2.9601 -0.0006 0.0027 0.0034 7.3991 18.0085 28.2341 39.7554
frequency: 17.5874 28.1246 39.7516 48.6487 59.0927 79.7017 98.0705 108.9567 113.5857 127.0176 149.6214 161.1480 167.0465 197.7547 226.0317 242.2191 279.1600 312.1520 335.4277 358.4189 377.8030 398.5360 444.6250 448.6513 496.4746 531.3407 544.6902 595.8832 645.4938 685.9537 692.4599 700.8864 705.9164 725.3586 797.7270 845.8418 862.8292 919.9382 951.2636 965.1344 981.8692 1030.5785 1099.0602 1113.7799 1115.8723 1131.3645 1132.2589 1137.9270 1210.4276 1225.1014 1254.0202 1359.3864 1395.0429 1406.6056 1423.4402 1424.6154 1456.0981 1458.1876 1462.6641 1469.5547 1470.2236 1583.1341 1593.0381 2990.6457 2991.1658 3099.3469 3099.4073 3140.1017 3141.7796 3162.1498 3189.4167 3192.5525
redmass: 7.5895 6.9927 4.5117 3.5381 16.1809 4.5639 7.0197 1.0863 1.9017 1.6975 4.7863 11.3161 5.7119 8.0477 9.3501 6.3305 9.6184 8.8294 10.1339 7.0330 7.9391 8.0073 5.4550 5.0231 11.6512 5.0134 6.1385 9.7778 8.5032 6.2266 10.3990 12.1621 11.9488 4.6455 9.7005 1.4439 8.0722 1.4352 11.5858 11.2843 1.3424 2.8812 3.3136 1.2404 1.2415 1.2956 1.2938 1.2829 7.0250 3.8822 1.4917 6.5337 11.6098 5.2261 1.1220 1.1214 1.0528 1.0809 2.5230 1.0590 1.0522 8.5103 7.3656 1.0300 1.0300 1.1050 1.1052 1.1041 1.1039 1.0911 1.0928 1.0956
irintensity: 0.1709 1.0996 2.2343 3.3943 0.0100 6.3355 3.8836 0.3109 0.8765 1.4968 3.2689 4.8004 0.1122 0.6204 10.4384 9.1193 13.7953 9.4562 3.0089 10.6724 8.4438 6.4421 2.5804 14.9298 11.3093 2.8000 30.3267 57.7423 89.5921 4.7929 75.4360 167.8467 111.8913 17.7252 72.3550 35.1120 173.7926 28.0843 237.4824 145.0718 1.0915 45.4284 28.3578 0.0621 0.6342 0.9966 0.3910 24.1323 371.5077 367.9452 1.3802 39.0332 33.2494 93.6569 3.7946 6.0212 10.3303 10.6541 127.3814 21.2253 17.0624 12.5021 105.4788 49.5376 27.6962 24.0081 11.9321 8.7787 10.2023 0.0502 8.9142 3.9727
temp: 298.150 k
press: 1.00000 atm
elementType: 17 16 15 8 8 8 8 8 7 6 6 6 6 6 6 6 6 1 1 1 1 1 1 1 1 1
symmnumber: 1
zpe: 445173.2 jmol-1
zpe.correction: 0.169558 hartree
zpe.thermalcorrener: 0.188684 hartree
zpe.thermalcorrenthalpy: 0.189628 hartree
zpe.thermalcorrgfe: 0.118445 hartree
zpe.sumelectzpe: -1939.086005 hartree
zpe.sumelectthermal: -1939.066879 hartree
zpe.sumelectthermalent: -1939.065935 hartree
zpe.sumelectthermalfe: -1939.137118 hartree
dipole: 6.6658 -0.4400 -0.7350
dipole: 6.7207
quadrupole: -134.5123 -109.2171 -126.7999
quadrupole: -5.8972 1.3217 5.2346
quadrupole: -11.0025 14.2927 -3.2902 -5.8972 1.3217 5.2346
hfenergy: -1939.2555624 hartree
pointgroup: C01 [X(C8H9Cl1N1O5P1S1)]
dipole: 2.6216683 -0.2764808 -0.2042802 debye
dipolederiv: -0.1447855 -0.1948571 0.0115442 -0.2271071 -0.6140323 0.0306158 -0.0053124 0.0002255 -0.029117 -0.4683131 -0.0137981 0.0056703 0.1033952 -0.3734866 0.0596095 -0.1233278 0.064756 -0.6829214 2.5945066 0.2107202 0.1356901 -0.7658935 1.635923 -0.0898216 0.1199751 -0.047933 1.9056253 -2.6087328 0.1288451 -0.2411235 0.2419411 -0.3737293 0.0642649 -0.022646 0.0579756 -0.48026 -0.8942368 -0.4129981 -0.0096246 -0.4017637 -1.0787364 -0.0137367 0.0621147 0.0280594 -0.5667758 -0.8590677 0.3309172 0.1025136 0.5346058 -1.0587437 -0.2091837 0.1727007 -0.2544632 -0.6698916 -0.7332332 -0.2138282 0.022853 -0.3157851 -0.731748 -0.0041387 0.0535481 0.0142024 -0.2253977 -0.8827635 0.1638041 0.0386667 0.2608436 -0.5891339 -0.0192609 0.0774172 -0.0258182 -0.2288305 2.0962093 0.1479325 -0.106036 0.1601773 1.0761425 0.0184395 -0.217286 0.002136 0.1986595 1.8942274 -0.2323493 0.1777677 0.3642903 -0.0596999 0.1003958 -0.4189777 0.0600337 0.0366565 -0.398021 0.4171172 -0.064156 0.4990042 0.9740186 -0.0682239 -0.0409137 -0.0228091 -0.0676066 -0.3531354 -0.0350938 -0.0333012 -0.4410539 -0.0616455 -0.0124104 0.0774581 0.0036032 -0.0920076 -0.9065163 -0.1178872 0.0243411 -0.1734494 0.0472267 -0.010876 0.1079222 0.008978 0.0467611 0.183982 -0.1273466 -0.0056865 0.2594018 -0.2091021 0.0107273 -0.0010656 0.0072137 -0.0465331 0.2710895 0.0726908 -0.0294261 -0.1444724 -0.0348085 0.0177595 -0.0343335 -0.0121187 -0.090289 0.2982167 0.072908 0.0044915 0.3368922 0.643381 -0.0291838 0.2429083 0.2426362 0.1855938 0.5333853 -0.3745157 -0.1804139 -0.2804308 0.5508688 0.1484722 0.0541816 -0.1262947 0.1430628 0.0736594 0.0351749 0.0315226 0.0646723 0.0418825 0.0088526 0.0066599 -0.0016664 0.1377668 0.1253445 0.0463234 0.0041074 -0.0047721 0.1048591 -0.0055491 0.0124192 -0.0012249 0.1725538 0.1102306 -0.0381733 0.0004104 -0.0102784 0.060579 -0.0029115 -0.0035335 0.0037028 0.168894 -0.0490441 -0.0815065 0.0655521 -0.0870201 0.0243396 0.003093 0.0683634 0.0026924 0.0921697 0.1261489 0.0136245 -0.0065968 -0.0084324 0.0333155 0.0551415 -0.0859979 -0.0507847 -0.0902617 0.0208868 0.1205062 -0.0394676 0.0295559 -0.0522091 0.0089777 -0.0694552 -0.0160087 0.0885621 0.0559514 0.0032399 -0.0274109 0.0281694 -0.0400833 -0.1034055 -0.0246503 -0.099055 0.0516544 0.04815 0.0406403 0.049913 0.0270978 0.0637179 0.0242752 -0.0344512 0.1298794 -0.0610682 -0.1341389 0.0379095 0.0681994 -0.0495881 0.0209044 0.0180775 0.0262823 0.0320823 0.1030005 unknown
polarizability: 237.4651053|9.2872393|175.7386919|-2.8898011|-1.7733389|110.5854109 unknown
InChI: InChI=1S/C8H9ClNO5PS/c1-13-16(17,14-2)15-8-4-3-6(10(11)12)5-7(8)9/h3-5H,1-2H3
charge 0 multiplicity 1
26 atoms
Cl -0.255723 3.073913 -0.216468
S  2.575842 -0.635564 2.243868
P  2.701076 -0.269442 0.22759
O  1.369577 0.594771 -0.533257
O  3.979279 0.705222 -0.365921
O  2.788618 -1.604623 -0.851783
O  -4.571838 -1.654541 0.169678
O  -4.949304 0.595183 0.251496
N  -4.168619 -0.427925 0.144776
C  0.023275 0.294681 -0.322138
C  -0.882907 1.379855 -0.192584
C  -0.465786 -1.034765 -0.299267
C  -2.716899 -0.181092 -0.01738
C  -2.258386 1.154434 -0.044357
C  -1.839893 -1.280649 -0.141528
C  4.249281 2.005289 0.303822
C  3.8224 -2.643956 -0.602631
H  0.242217 -1.859619 -0.425755
H  -2.969058 1.978096 0.05686
H  -2.242417 -2.295992 -0.121184
H  5.196032 2.347587 -0.137384
H  4.358525 1.866843 1.394738
H  3.43623 2.716375 0.080182
H  3.553844 -3.465544 -1.281881
H  3.789298 -2.984859 0.448246
H  4.820436 -2.246979 -0.852339
