program: Gaussian 09
title: 000198845
version: EM64L-G09RevD.01
frameworkgroup: C1[X(C16H18N4O2S)]
method: RPBEPBE
basis: SDD
operation: Freq
keyword: #p
keyword: freq=noraman
keyword: PBEPBE/SDD
title: #p freq=noraman PBEPBE/SDD
converged: YES YES NO NO
title: Mulliken charges:
elementType: S O O N N N N C C C C C C C C C C C C C C C C H H H H H H H H H H H H H H H H H H
charge: 0.917333 -0.548013 -0.554753 -0.258548 -0.095831 -0.037782 0.062515 0.351145 -0.077537 -0.501066 0.351978 -0.109118 -0.356161 -0.371018 -0.111645 -0.133787 -0.265210 -0.283501 -0.623323 -0.615942 -0.191412 -0.330975 -0.742695 0.238895 0.233354 0.292771 0.239924 0.296638 0.286835 0.290291 0.253631 0.189388 0.232481 0.233476 0.197609 0.225787 0.238136 0.252184 0.266756 0.293127 0.264065
chargesum: 0.00000
title: Mulliken charges with hydrogens summed into heavy atoms:
elementType: S O O N N N N C C C C C C C C C C C C C C C C
charge: 0.917333 -0.548013 -0.554753 -0.258548 -0.095831 -0.037782 0.062515 0.351145 -0.077537 -0.028818 0.351978 -0.109118 -0.063390 -0.131094 -0.111645 0.162851 0.021625 0.006790 0.052177 0.040929 0.046724 -0.078792 0.081253
polarizability: 4.04379343e+02 2.11114021e+01 2.38521579e+02 1.85235003e+00 1.82922785e+00 1.35945918e+02
1716.lowfreq: -3.0966 0.0017 0.0022 0.0022 2.4313 7.5245 24.4755 34.2695 41.5162
frequency: 24.3566 34.1871 41.5148 55.2310 68.6027 81.8393 87.4328 95.1759 131.1979 158.5478 162.5437 171.1015 182.2487 229.6200 230.5178 240.1441 246.6638 275.4131 284.2344 301.5724 322.7809 329.8641 336.9395 357.6087 381.6645 391.8128 412.9334 430.5045 432.2840 461.1417 518.4741 570.8738 577.2720 583.7552 600.4571 614.4755 641.3511 685.3044 687.2082 732.5856 743.5221 762.3372 785.3997 786.8676 804.4689 829.2655 846.0580 867.0573 877.3101 885.7535 915.1171 952.5104 964.5491 968.4170 974.5550 993.5654 996.9728 1006.0171 1007.9365 1020.6562 1033.1404 1039.5295 1054.6735 1091.3306 1105.6125 1110.6140 1134.2539 1139.3239 1167.1690 1173.6048 1182.2824 1223.4026 1253.3114 1265.5684 1292.1246 1300.8241 1337.3382 1352.6339 1368.7786 1369.8560 1389.5360 1396.8486 1407.7919 1417.4895 1419.3739 1421.2487 1441.2959 1460.0239 1461.2031 1471.0028 1474.1090 1474.9815 1482.7460 1488.1671 1489.5555 1532.9255 1584.1582 1596.5662 1600.2118 2866.1771 2876.5216 2910.4983 2967.4597 3023.9930 3029.2959 3033.2857 3082.8184 3091.1201 3145.3900 3146.9536 3148.9024 3167.2476 3171.5408 3174.1145 3179.1318 3183.2465 3195.5959
redmass: 5.0664 5.4059 4.7665 3.9343 3.0278 4.9418 4.0785 4.6037 4.2259 1.7734 2.1726 5.0852 4.1470 2.5704 1.6761 2.8883 1.2768 4.2880 2.4950 5.6877 5.7796 4.0746 5.0371 2.5932 4.2635 4.1714 2.9485 7.6911 2.8108 3.8503 3.5830 5.8795 4.5168 6.4862 6.3099 6.9357 7.0099 6.2313 6.9619 4.5231 4.2475 4.7983 1.5671 8.9542 4.1801 5.4426 1.3646 1.6541 4.4061 3.0954 1.3810 1.3597 1.7098 1.4057 1.6508 1.6033 2.9563 1.8504 2.4596 2.6541 1.6935 2.8942 2.3814 1.2521 1.9657 1.5704 2.2439 1.6194 2.3670 2.5660 1.1332 2.7004 2.4802 1.5261 1.2695 1.1404 1.9624 1.8029 2.8874 1.7865 6.4531 3.3664 1.0528 3.7201 1.1665 1.0571 1.1761 1.1774 1.6486 1.2131 2.6923 1.2935 1.1351 1.0840 4.4315 7.7048 7.6256 6.3827 6.2141 1.0559 1.0556 1.0622 1.0941 1.0752 1.0246 1.0734 1.1009 1.1013 1.0887 1.0910 1.0897 1.0949 1.0915 1.0961 1.1070 1.1078 1.1002
irintensity: 3.8096 0.7944 1.1318 0.8733 0.3569 3.6385 3.8285 5.6957 4.6273 0.4002 1.2703 1.9247 0.2160 1.0625 0.4679 0.2104 1.3788 6.8694 2.5487 2.6188 32.7847 2.9073 6.6129 2.4763 6.8972 4.5793 0.7752 54.9627 0.5544 0.5604 10.2130 5.9113 14.8840 59.6620 21.7292 0.2395 1.1648 5.8576 17.4860 2.0759 5.8537 21.2087 27.5750 100.4480 15.1915 1.3385 15.2407 26.2627 12.5667 32.3818 0.5294 0.6943 28.1358 64.5035 1.7333 2.5352 2.2493 48.5337 53.5059 11.7437 17.2812 9.5685 59.3739 3.6396 21.9111 1.5065 37.2848 4.0759 33.9619 13.9389 1.7676 14.7235 4.8019 7.7986 2.7578 4.2467 40.0737 21.1765 13.0659 3.6093 17.7707 19.5095 10.2367 0.9379 6.4545 16.4046 4.0710 21.4585 16.1406 1.4702 40.2687 7.6634 23.6667 12.6409 27.7209 6.0238 1.4039 48.1569 2.7734 61.8471 128.6894 85.5117 31.0294 36.5015 1.3791 30.2873 21.7656 39.9505 2.5428 15.0822 1.3333 9.7586 2.6786 0.7984 1.1634 1.4627 9.6288
temp: 298.150 k
press: 1.00000 atm
elementType: 16 8 8 7 7 7 7 6 6 6 6 6 6 6 6 6 6 6 6 6 6 6 6 1 1 1 1 1 1 1 1 1 1 1 1 1 1 1 1 1 1
symmnumber: 1
zpe: 828758.9 jmol-1
zpe.correction: 0.315658 hartree
zpe.thermalcorrener: 0.337845 hartree
zpe.thermalcorrenthalpy: 0.338789 hartree
zpe.thermalcorrgfe: 0.263237 hartree
zpe.sumelectzpe: -1386.154371 hartree
zpe.sumelectthermal: -1386.132183 hartree
zpe.sumelectthermalent: -1386.131239 hartree
zpe.sumelectthermalfe: -1386.206791 hartree
dipole: -7.5228 5.8980 5.4985
dipole: 11.0278
quadrupole: -148.0855 -148.9076 -143.5657
quadrupole: -6.9634 21.7072 -1.7513
quadrupole: -1.2326 -2.0547 3.2873 -6.9634 21.7072 -1.7513
hfenergy: -1386.4700284 hartree
pointgroup: C01 [X(C16H18N4O2S1)]
dipole: 2.7918126 -2.9013934 1.6160948 debye
polarizability: 404.6452512|13.8615238|231.3146371|16.4767267|24.6298208|142.8869512 unknown
InChI: InChI=1S/C16H18N4O2S/c1-19(2)11-14-15(18-16-17-9-4-10-20(14)16)12-5-7-13(8-6-12)23(3,21)22/h4-10H,11H2,1-3H3
charge 0 multiplicity 1
41 atoms
S  -5.426144 0.079205 -0.355304
O  -6.004762 1.60996 -0.390528
O  -5.735601 -1.008095 -1.540958
N  2.902435 0.127929 0.446829
N  2.492818 -2.758115 -0.594998
N  1.254538 1.725852 0.36869
N  3.56778 2.48844 0.627831
C  1.698401 -0.567657 0.306502
C  0.702331 0.444852 0.245441
C  1.661766 -2.065942 0.43141
C  -0.760924 0.31614 0.08851
C  2.588264 1.550466 0.487668
C  -1.582334 1.383374 0.552379
C  -1.37298 -0.801231 -0.546384
C  -3.543364 0.173059 -0.153893
C  4.214447 -0.307162 0.533697
C  -2.984962 1.321213 0.432488
C  -2.775895 -0.882129 -0.670504
C  2.039312 -2.49947 -1.979075
C  2.612488 -4.203839 -0.307744
C  5.205332 0.657215 0.680323
C  4.838624 2.046063 0.726602
C  -6.044499 -0.703355 1.282164
H  2.076356 -2.354295 1.421028
H  0.601172 -2.409046 0.426827
H  -1.092961 2.259828 0.986886
H  -0.75698 -1.589145 -0.988646
H  4.381735 -1.381982 0.431332
H  -3.626414 2.148826 0.753509
H  -3.264311 -1.713799 -1.189653
H  2.00035 -1.412402 -2.164273
H  1.028467 -2.927623 -2.195566
H  2.756749 -2.945705 -2.689434
H  3.299966 -4.669063 -1.035388
H  1.635821 -4.746066 -0.362046
H  3.030921 -4.354023 0.703994
H  6.253072 0.356954 0.74597
H  5.609097 2.815613 0.841444
H  -5.743324 -0.028736 2.095126
H  -7.136465 -0.757803 1.170665
H  -5.584117 -1.697907 1.35688
