program: Gaussian 09
title: 000198840
version: EM64L-G09RevD.01
frameworkgroup: C1[X(C18H20N4OS)]
method: RPBEPBE
basis: SDD
operation: Freq
keyword: #p
keyword: freq=noraman
keyword: PBEPBE/SDD
title: #p freq=noraman PBEPBE/SDD
converged: YES YES NO NO
title: Mulliken charges:
elementType: S O N N N N C C C C C C C C C C C C C C C C C C H H H H H H H H H H H H H H H H H H H H
charge: 0.209040 -0.243676 -0.091078 -0.267600 -0.030293 0.064245 -0.525369 -0.336416 -0.343655 0.357978 -0.328193 -0.319729 -0.065896 -0.110541 0.323206 -0.147521 -0.378212 -0.427481 -0.200057 -0.337977 -0.238070 -0.181959 -0.235627 -0.866113 0.213986 0.260422 0.183020 0.238357 0.213422 0.198021 0.199334 0.219502 0.218563 0.193276 0.252446 0.279974 0.296431 0.236042 0.250537 0.241705 0.233997 0.265173 0.262791 0.263995
chargesum: 0.00000
title: Mulliken charges with hydrogens summed into heavy atoms:
elementType: S O N N N N C C C C C C C C C C C C C C C C C C
charge: 0.209040 -0.243676 -0.091078 -0.267600 -0.030293 0.064245 -0.050961 0.084962 0.067789 0.357978 0.090644 0.092110 -0.065896 -0.110541 0.323206 0.104925 -0.098238 -0.131051 0.035985 -0.087440 0.003636 0.052038 -0.235627 -0.074153
polarizability: 4.42661768e+02 -4.44809660e+01 2.55498924e+02 -1.45751650e+00 -1.88155482e+01 1.36229003e+02
1716.lowfreq: -0.0002 0.0013 0.0016 1.9164 4.4875 7.8307 27.9573 35.8182 40.7712
frequency: 27.9481 35.6441 40.5461 51.6460 58.9652 64.4525 84.9753 113.0764 138.6939 152.2382 172.0331 212.6644 225.1253 229.5316 246.9335 258.7519 285.7135 296.6523 323.8363 329.5039 359.2309 384.8646 398.5985 413.8427 436.9764 452.9151 466.9322 473.4364 513.7160 571.6435 579.0291 595.9775 604.5581 615.9681 633.2503 671.6582 688.5681 700.2690 735.1126 746.2940 753.4989 763.5657 776.5968 801.3297 809.6299 841.6456 847.3278 848.6144 860.3919 893.8174 909.2181 936.7277 965.1510 966.2356 982.4681 987.5413 992.4645 1000.1662 1006.9646 1022.3440 1026.5263 1031.3544 1054.1096 1075.0538 1083.7035 1097.7399 1109.1783 1115.4089 1124.8856 1132.7348 1149.3841 1179.5118 1191.1869 1203.8967 1207.4350 1239.3705 1262.9627 1277.4851 1289.9704 1308.0388 1326.9479 1338.0719 1343.1906 1348.4850 1351.6806 1359.1365 1367.7354 1372.4250 1380.9714 1401.0691 1418.1119 1428.9588 1445.9352 1449.1689 1452.2384 1453.9835 1457.6977 1461.8632 1468.0394 1470.0809 1474.2503 1493.6905 1535.0097 1559.7409 1594.8313 1611.7863 2834.6763 2853.6361 2871.1892 2954.2350 2963.6390 3006.4397 3009.7051 3018.9056 3039.0128 3083.5014 3088.4951 3099.6668 3122.5198 3133.5445 3135.3613 3146.5763 3149.7193 3164.4939 3165.8349 3194.1869
redmass: 3.3797 6.0559 4.0727 5.3964 4.0439 4.4634 4.5448 5.1215 4.5364 4.7068 4.0937 1.8195 2.4966 3.3867 3.1325 2.2374 4.3011 3.9282 4.1398 2.2889 5.4362 4.6338 1.9010 3.0757 4.7027 7.8852 3.9912 3.5999 3.3124 3.5026 6.2875 3.5213 3.5948 4.7315 6.6109 7.1755 5.2089 7.3973 4.3294 4.9254 4.0321 1.8048 3.4535 4.9887 3.8824 1.4436 1.5615 1.3930 5.0352 1.3459 2.5177 1.3594 1.5821 1.7121 1.3542 1.3772 2.6532 1.4223 2.8199 2.9792 2.1873 3.3396 1.9788 3.2063 3.6439 2.3135 3.1041 2.3609 1.8125 1.9305 2.6267 3.1569 1.0665 1.6684 1.1979 1.4143 1.3146 1.4086 1.2460 1.3037 1.3149 1.6622 1.4574 1.3496 1.8698 1.5161 1.9636 1.2818 1.8562 2.7371 3.3175 4.4073 1.0815 1.0837 1.0985 1.0527 1.1654 1.2365 1.9943 1.3222 2.6905 5.0106 6.5964 6.7646 6.3515 5.8470 1.0710 1.0696 1.0687 1.0669 1.0666 1.0291 1.0863 1.0899 1.0891 1.0962 1.0980 1.0931 1.1061 1.1019 1.0890 1.0907 1.0922 1.0904 1.0958 1.0998
irintensity: 3.1830 0.5552 0.0808 0.4387 0.8508 1.0602 5.3899 0.5342 3.4763 1.6067 0.6855 0.2420 1.8451 0.9440 0.3386 1.6709 3.1981 6.2212 2.4144 8.2378 1.0939 1.5445 0.3761 1.2935 1.1922 17.4519 4.5655 2.8765 13.8821 5.4950 4.3860 1.2564 4.2607 2.5689 0.3254 0.9137 1.6020 5.5962 1.2095 7.5362 32.7324 27.3299 19.9469 14.7057 15.0014 33.1256 0.4837 17.0136 11.0105 2.0983 18.5399 0.2516 4.7423 8.1264 2.6153 14.4285 47.2586 7.8452 15.6309 5.5005 8.7545 17.5747 22.5593 46.5385 49.9915 12.2585 50.2101 19.2623 12.1782 34.1112 7.5870 26.2734 3.0182 1.7292 31.3710 24.8337 12.5490 8.8792 2.0570 2.7825 16.0785 28.0474 48.9864 25.3105 4.2121 5.5221 4.7473 4.9875 12.0388 74.8602 15.8748 4.4447 3.1350 1.9317 12.9369 16.5759 40.8450 93.6920 33.3143 45.4057 20.2393 39.6193 3.3127 5.0139 60.0513 125.6244 52.1866 58.7598 138.9431 42.8513 64.5964 28.6750 8.2175 40.0652 24.4718 39.0277 32.2369 13.6356 18.5427 10.8467 8.0889 14.6615 10.6318 5.8984 4.3706 9.8561
temp: 298.150 k
press: 1.00000 atm
elementType: 16 8 7 7 7 7 6 6 6 6 6 6 6 6 6 6 6 6 6 6 6 6 6 6 1 1 1 1 1 1 1 1 1 1 1 1 1 1 1 1 1 1 1 1
symmnumber: 1
zpe: 920633.2 jmol-1
zpe.correction: 0.350651 hartree
zpe.thermalcorrener: 0.371877 hartree
zpe.thermalcorrenthalpy: 0.372821 hartree
zpe.thermalcorrgfe: 0.298984 hartree
zpe.sumelectzpe: -1388.426383 hartree
zpe.sumelectthermal: -1388.405157 hartree
zpe.sumelectthermalent: -1388.404212 hartree
zpe.sumelectthermalfe: -1388.478049 hartree
dipole: 1.9418 4.8878 -3.0137
dipole: 6.0616
quadrupole: -123.7057 -169.1519 -150.3127
quadrupole: -11.8930 -4.1610 -1.0574
quadrupole: 24.0177 -21.4285 -2.5892 -11.8930 -4.1610 -1.0574
hfenergy: -1388.7770332 hartree
pointgroup: C01[X(C18H20N4O1S1)]
dipole: -0.1255842 -2.1951461 0.9235758 debye
polarizability: 442.3047843|-43.3993879|258.028242|-15.7918017|-1.9788172|134.0566692 unknown
InChI: InChI=1S/C18H20N4OS/c1-24-15-5-3-14(4-6-15)17-16(13-21-9-11-23-12-10-21)22-8-2-7-19-18(22)20-17/h2-8H,9-13H2,1H3
charge 0 multiplicity 1
44 atoms
S  -5.164373 3.239794 0.441388
O  -0.755389 -4.705578 -1.297022
N  -0.196772 -2.253987 0.145409
N  2.510476 -0.045451 0.360032
N  1.615892 2.01451 -0.155644
N  4.04028 1.753357 -0.351376
C  0.484553 -1.379217 1.143119
C  0.712851 -2.740123 -0.92392
C  -0.890447 -3.392552 0.804502
C  1.130053 -0.156728 0.556717
C  -0.081139 -3.567834 -1.946275
C  -1.658959 -4.210847 -0.246519
C  0.6053 1.124222 0.222216
C  2.775765 1.329056 -0.080568
C  -0.795689 1.569868 0.257117
C  3.558407 -0.936574 0.502971
C  -1.076041 2.963739 0.343767
C  -1.887703 0.662337 0.193379
C  4.84723 -0.489946 0.22598
C  5.046047 0.865149 -0.200513
C  -2.398588 3.43147 0.397137
C  -3.218313 1.12928 0.247054
C  -3.484822 2.514937 0.357983
C  -6.269375 1.726433 0.366086
H  1.246035 -1.957327 1.728917
H  -0.286672 -1.053822 1.867302
H  1.533744 -3.375983 -0.502182
H  1.169543 -1.869878 -1.429972
H  -1.59865 -2.994902 1.557086
H  -0.166673 -4.062909 1.333458
H  -0.833147 -2.919284 -2.444406
H  0.585762 -4.012503 -2.702664
H  -2.11189 -5.109905 0.202677
H  -2.453082 -3.579414 -0.700679
H  3.327208 -1.953894 0.827304
H  -0.235432 3.664147 0.363298
H  -1.69264 -0.407923 0.047411
H  5.693857 -1.171646 0.330243
H  6.052921 1.232118 -0.424538
H  -2.592962 4.507634 0.468546
H  -4.035742 0.403913 0.183181
H  -6.132625 1.188905 -0.58528
H  -7.298046 2.114313 0.423833
H  -6.079251 1.061142 1.222946
