program: Gaussian 09
title: 000198791
version: EM64L-G09RevD.01
frameworkgroup: C1[X(C8H13BrN4O3)]
method: RPBEPBE
basis: SDD
operation: Freq
keyword: #p
keyword: freq=noraman
keyword: PBEPBE/SDD
title: #p freq=noraman PBEPBE/SDD
converged: YES YES NO NO
title: Mulliken charges:
elementType: Br O O O N N N N C C C C C C C C H H H H H H H H H H H H H
charge: -0.058415 -0.428200 -0.152472 -0.267366 -0.118306 -0.348761 -0.026711 0.082470 -0.087528 -0.440254 -0.399057 -0.313844 0.185297 -0.111884 -0.293300 -0.643293 0.270823 0.262729 0.229709 0.174166 0.241100 0.323202 0.234167 0.231692 0.279507 0.336777 0.268749 0.285959 0.283042
chargesum: 0.00000
title: Mulliken charges with hydrogens summed into heavy atoms:
elementType: Br O O O N N N N C C C C C C C C
charge: -0.058415 -0.091423 -0.152472 -0.267366 -0.118306 -0.025559 -0.026711 0.082470 0.183296 0.052184 0.016210 0.152015 0.185297 0.167623 -0.024551 -0.074292
polarizability: 2.18714341e+02 1.38182379e+01 1.53758100e+02 -1.70414891e+01 8.14566031e+00 8.37768375e+01
1716.lowfreq: -11.4887 -4.8185 -0.0007 -0.0006 -0.0001 1.4989 6.6123 15.3263 29.0397
frequency: 5.3167 15.1029 28.9492 41.3521 53.8243 79.6737 83.1970 99.2958 152.8619 173.6455 180.2772 238.4717 260.1436 288.1355 292.9755 312.7639 351.8786 417.0647 423.2349 460.3713 493.1886 533.1381 576.3554 607.3370 620.4692 629.0958 695.4751 722.8833 763.8449 765.8499 777.8745 837.5882 865.4726 882.1755 903.9162 960.7775 969.1972 1026.1390 1052.7588 1058.4137 1082.3414 1087.8568 1112.4077 1142.1268 1150.4949 1170.3705 1189.7384 1203.8229 1218.0956 1235.4243 1248.9802 1282.1905 1294.2856 1309.4301 1329.9225 1338.5476 1359.4403 1361.2190 1366.1689 1368.3501 1379.7513 1415.9309 1444.4170 1446.6320 1470.2982 1479.6931 1490.7604 1495.8703 2813.3456 2934.2191 3002.8525 3028.9660 3046.6315 3062.6358 3076.2293 3116.1741 3154.6208 3236.0269 3260.9542 3487.6659 3533.5740
redmass: 5.1691 7.3747 8.0478 2.7359 6.0157 4.9406 4.7156 6.5006 5.2680 3.1941 4.6264 6.1577 4.6461 5.9378 3.3141 1.3149 2.6599 3.8837 7.9914 2.5106 3.1858 3.5750 1.3837 4.9402 5.8567 3.9098 11.8070 4.5496 3.1449 1.3510 1.4163 2.7408 1.4540 5.3419 2.1773 1.7268 2.2354 1.9436 3.4665 2.0548 1.8302 2.1700 3.1619 3.3317 1.8638 1.9990 1.5922 1.4860 1.1909 3.0360 1.6302 1.2860 2.1623 1.4320 1.4238 3.1644 3.8811 1.7303 1.8812 1.6001 1.4251 2.1028 1.6212 1.1610 2.1558 1.0785 1.1894 1.1011 1.0721 1.0689 1.0859 1.0652 1.0927 1.0573 1.0861 1.0995 1.1117 1.0927 1.1080 1.0768 1.0661
irintensity: 0.5585 0.3388 1.7517 6.3808 1.2853 5.5248 1.8751 0.5323 2.6488 2.4308 4.3454 2.3528 1.1819 1.7343 4.0779 115.6144 48.6397 12.0263 6.9189 25.2861 1.6913 23.4013 82.8944 94.4690 19.2720 0.7024 0.7122 21.6995 20.5280 0.4504 49.3041 11.2356 8.2275 4.3794 13.7734 11.8510 49.6586 1.8362 5.8546 33.1079 29.6178 3.6750 74.7828 114.6816 82.9688 9.5930 12.1698 8.7405 17.0275 71.2171 27.6618 10.1946 91.8582 33.4680 4.7484 143.8296 162.0336 39.6078 13.5854 47.8504 3.8617 9.9628 11.3123 6.1156 14.8909 5.8007 56.7135 1.4321 133.5773 61.9952 30.2347 21.5134 16.5443 14.7985 14.5399 1.3936 9.1575 3.1656 0.1505 81.1182 9.3281
temp: 298.150 k
press: 1.00000 atm
elementType: 35 8 8 8 7 7 7 7 6 6 6 6 6 6 6 6 1 1 1 1 1 1 1 1 1 1 1 1 1
symmnumber: 1
zpe: 579763.9 jmol-1
zpe.correction: 0.220820 hartree
zpe.thermalcorrener: 0.237909 hartree
zpe.thermalcorrenthalpy: 0.238853 hartree
zpe.thermalcorrgfe: 0.169482 hartree
zpe.sumelectzpe: -769.422577 hartree
zpe.sumelectthermal: -769.405489 hartree
zpe.sumelectthermalent: -769.404545 hartree
zpe.sumelectthermalfe: -769.473916 hartree
dipole: 3.0150 6.8183 2.8563
dipole: 7.9836
quadrupole: -118.4394 -109.9674 -104.3344
quadrupole: 15.9046 6.6315 5.7536
quadrupole: -7.5257 0.9463 6.5794 15.9046 6.6315 5.7536
hfenergy: -769.6433978 hartree
pointgroup: C01 [X(C8H13Br1N4O3)]
dipole: -0.7087365 2.9444437 -0.8329229 debye
polarizability: 214.9633193|-20.9923141|159.7555693|-12.6982302|2.1645622|81.5303894 unknown
InChI: InChI=1S/C8H13BrN4O3/c9-1-2-10-5-7(14)6-12-4-3-11-8(12)13(15)16/h3-4,7,10,14H,1-2,5-6H2
charge 0 multiplicity 1
29 atoms
Br 6.36053 -1.448946 0.159964
O  -0.088331 2.852032 0.886569
O  -1.798168 -3.039873 -0.466022
O  -0.020104 -1.625008 -0.711784
N  -1.777951 0.612409 -0.516536
N  2.431292 0.216843 0.023966
N  -3.456452 -0.83604 0.059202
N  -1.294407 -1.863308 -0.510955
C  0.383699 1.566523 0.343363
C  -0.465736 1.178856 -0.898557
C  1.89326 1.582186 0.015537
C  3.850159 0.026194 -0.308513
C  -2.166228 -0.726118 -0.326382
C  -2.899945 1.372504 -0.213432
C  -3.920404 0.467102 0.135195
C  4.395865 -1.102015 0.580766
H  0.211429 0.845454 1.15913
H  0.061091 0.436144 -1.513318
H  -0.651012 2.081357 -1.508598
H  2.051644 2.118015 -0.959702
H  2.400136 2.180743 0.797839
H  1.797793 -0.510058 -0.3263
H  4.399529 0.959272 -0.087641
H  4.035462 -0.213819 -1.378975
H  -2.875467 2.458122 -0.249643
H  0.249919 3.588907 0.313868
H  -4.941332 0.686214 0.436898
H  4.356576 -0.837603 1.647001
H  3.893753 -2.06479 0.399455
