program: Gaussian 09
title: 000198823
version: EM64L-G09RevD.01
frameworkgroup: C1[X(C23H33ClO2)]
method: RPBEPBE
basis: SDD
operation: Freq
keyword: #p
keyword: freq=noraman
keyword: PBEPBE/SDD
title: #p freq=noraman PBEPBE/SDD
converged: NO YES NO NO
title: Mulliken charges:
elementType: Cl O O C C C C C C C C C C C C C C C C C C C C C C C H H H H H H H H H H H H H H H H H H H H H H H H H H H H H H H H H
charge: -0.073804 -0.208138 -0.444399 0.338059 -0.151355 0.297010 -0.188028 -0.115542 -0.529577 -0.576126 -0.516296 -0.534854 0.209771 -0.842173 -0.496145 -0.195695 0.099346 0.590142 -0.547864 -0.799037 -0.400553 -0.462995 -0.714730 -0.488947 -0.111522 -0.801941 0.234090 0.233319 0.226104 0.222605 0.200667 0.221229 0.228676 0.266941 0.206831 0.222312 0.207200 0.259042 0.226039 0.227425 0.222556 0.220526 0.258850 0.224047 0.202712 0.249947 0.221627 0.218101 0.228726 0.209848 0.219288 0.224314 0.219078 0.257384 0.228146 0.244566 0.242951 0.256679 0.333572
chargesum: 0.00000
title: Mulliken charges with hydrogens summed into heavy atoms:
elementType: Cl O O C C C C C C C C C C C C C C C C C C C C C C C
charge: -0.073804 -0.208138 -0.110827 0.338059 0.082735 0.297010 0.045291 0.110561 -0.106305 -0.126222 -0.042525 -0.105342 0.209771 -0.129667 -0.053063 0.063155 0.099346 0.590142 -0.121106 -0.109362 -0.400553 -0.024421 -0.052050 -0.231564 0.116624 -0.057746
polarizability: 3.34059412e+02 4.93938066e+00 2.42449100e+02 -1.62673136e+01 -2.74248395e+00 2.05551099e+02
1716.lowfreq: -5.0604 -0.0018 -0.0014 -0.0006 5.8529 12.4410 29.2765 38.9551 56.5546
frequency: 28.9987 38.7639 56.4772 72.0894 78.0733 98.6278 109.3938 118.7517 128.7342 132.9211 152.1003 159.5396 169.0089 187.3572 200.9112 220.2937 229.1843 239.5298 243.5584 256.3367 264.7317 272.4838 286.5565 292.7208 304.7325 322.3118 334.3074 347.7593 361.5307 365.6749 383.8885 396.7297 403.7210 422.3845 434.2000 454.9911 475.5070 482.6640 507.5992 523.2821 528.9138 549.2214 565.6042 580.4671 600.6095 638.0012 656.7423 673.8823 691.2069 712.2920 761.7739 772.8828 788.9198 795.3077 808.4379 823.9267 843.7269 847.7412 869.0469 876.0168 896.6487 903.0497 917.9853 930.8111 936.3405 942.2642 953.7531 976.5850 983.1428 991.1800 1000.1963 1006.5525 1010.1881 1024.8885 1025.5578 1041.0276 1064.3843 1065.1567 1074.5651 1085.3677 1096.2566 1108.9977 1118.9296 1124.2048 1133.3409 1136.5977 1141.1387 1145.1949 1158.3670 1174.8008 1191.0645 1205.0797 1205.8537 1215.8234 1232.0452 1234.7805 1239.6460 1250.4496 1256.5313 1276.0492 1284.0880 1293.1739 1302.1865 1305.9746 1314.2944 1315.3668 1319.5117 1331.7973 1332.9706 1338.8800 1339.9256 1343.7808 1351.7641 1356.0642 1359.7029 1360.2103 1367.1924 1388.9245 1399.1149 1400.2220 1442.3754 1450.4007 1455.4090 1460.4681 1466.9431 1469.1312 1471.6301 1474.5305 1477.1374 1480.9343 1481.9271 1486.5374 1487.7109 1495.6070 1498.7642 1607.3303 1611.4544 1642.1039 2929.1142 2937.1536 2953.2063 2970.5945 2973.1612 2981.9042 2982.9408 2985.7027 2986.1572 2988.9761 2990.2040 2990.9033 2993.1152 3019.4415 3029.5782 3035.9428 3040.2292 3045.2604 3050.5029 3051.9323 3058.2717 3069.9725 3070.3955 3072.2858 3078.5061 3079.4171 3082.8052 3092.7171 3095.6818 3120.2184 3132.9107 3143.7574 3555.4164
redmass: 4.9870 4.4478 4.6783 4.6481 3.8477 3.9798 4.1922 1.4328 2.2988 2.1129 3.7916 1.4956 3.2962 2.6432 2.4617 1.9927 2.4733 1.2419 1.3976 2.0240 2.0668 2.3339 2.2074 2.4682 3.3518 2.6817 2.9486 3.1361 3.0473 2.9871 2.9766 2.3292 2.5784 2.9044 3.3891 3.5170 3.0566 3.8264 2.8419 3.2510 3.2872 3.5837 3.3881 4.3684 3.6079 2.8508 3.2749 2.3836 3.0347 3.2156 3.0139 1.6353 1.8403 2.2366 2.0028 2.5973 2.0898 1.7539 1.7166 2.1210 2.0460 2.2420 2.0748 1.8839 2.1447 1.9508 2.2042 1.8466 1.9496 2.1216 2.0653 2.1260 2.3657 1.8981 2.1611 2.1653 2.0815 2.4500 2.0836 2.0775 1.4555 2.0695 2.1973 2.4000 2.2817 2.2223 1.7394 2.2325 2.0255 2.5246 1.9139 1.5594 1.7171 1.9682 1.6980 1.4217 1.6261 1.4572 1.5416 1.4494 1.3507 1.3228 1.5477 1.3752 1.4798 1.3708 1.4656 1.4526 1.7167 1.5149 1.3163 1.3779 1.4499 1.4471 1.3343 1.2898 1.2311 1.2019 1.1945 1.1920 1.0763 1.0875 1.0583 1.0752 1.0673 1.0790 1.0627 1.0620 1.0565 1.0727 1.0754 1.0603 1.0553 1.0791 1.0641 8.0056 8.3120 8.7444 1.0776 1.0818 1.0840 1.0679 1.0587 1.0371 1.0393 1.0581 1.0466 1.0599 1.0391 1.0553 1.0583 1.0631 1.0995 1.0993 1.0860 1.0999 1.0994 1.0938 1.0996 1.0980 1.0974 1.0993 1.0939 1.1014 1.1000 1.0990 1.0982 1.1013 1.0906 1.0912 1.0664
irintensity: 1.1708 0.7071 0.2270 3.7647 0.8557 1.5147 1.3190 0.5450 0.8250 0.5699 0.2669 0.5004 0.8576 0.4791 1.7481 0.9824 1.6438 0.3355 80.5922 5.3120 18.5508 6.8166 2.4806 1.5537 1.1206 0.9686 1.2340 1.4450 4.3468 3.0676 0.3937 0.7900 1.5578 2.4501 1.1675 1.1512 0.8922 1.9809 2.5806 1.0737 1.0131 2.1610 8.2523 9.2777 13.9097 3.0344 0.4465 7.0789 4.2344 1.4849 28.6127 4.0495 7.0643 18.5490 12.4421 32.7983 4.4021 5.4892 23.8034 5.7753 25.4883 26.4027 10.8677 4.4687 17.8050 2.4653 20.2078 13.9061 7.8929 25.4327 3.3956 12.0127 12.2293 11.0222 1.3859 7.7349 0.5783 1.6909 1.5371 8.5334 26.1280 25.8380 20.9710 7.9929 7.4813 13.3048 2.6842 10.6858 9.8034 10.6279 0.8602 26.3855 41.1508 18.8032 0.9359 21.4897 0.1147 4.0240 3.1520 2.0365 2.0561 6.9105 10.1033 1.9953 2.9526 5.9002 2.0116 2.3011 15.5532 0.1412 3.4727 4.4586 4.6918 4.3853 30.1686 41.7891 59.6672 22.2165 26.3219 23.1661 17.3723 11.4742 12.8943 4.5835 2.7880 9.3375 3.4313 2.3004 6.4698 26.7065 4.5487 3.3396 10.0021 14.6856 4.3981 120.0019 17.5792 2.9523 1.2751 0.9119 36.9341 18.3330 46.6496 38.7022 20.0127 18.2258 3.6861 29.1920 5.5859 52.1052 45.1052 25.1701 26.7482 11.0978 50.6572 25.4458 37.7585 34.5954 35.8761 67.8231 6.3599 45.7055 9.1173 38.1795 34.2354 19.4565 24.9901 10.7171 4.1127 4.8353 10.0562
temp: 298.150 k
press: 1.00000 atm
elementType: 17 8 8 6 6 6 6 6 6 6 6 6 6 6 6 6 6 6 6 6 6 6 6 6 6 6 1 1 1 1 1 1 1 1 1 1 1 1 1 1 1 1 1 1 1 1 1 1 1 1 1 1 1 1 1 1 1 1 1
symmnumber: 1
zpe: 1332471.6 jmol-1
zpe.correction: 0.507512 hartree
zpe.thermalcorrener: 0.533915 hartree
zpe.thermalcorrenthalpy: 0.534859 hartree
zpe.thermalcorrgfe: 0.453342 hartree
zpe.sumelectzpe: -1504.715236 hartree
zpe.sumelectthermal: -1504.688833 hartree
zpe.sumelectthermalent: -1504.687889 hartree
zpe.sumelectthermalfe: -1504.769406 hartree
dipole: 1.8604 -2.9486 0.7703
dipole: 3.5705
quadrupole: -205.6981 -167.8244 -162.3676
quadrupole: -6.3370 15.9216 2.0855
quadrupole: -27.0681 10.8057 16.2624 -6.3370 15.9216 2.0855
hfenergy: -1505.2227479 hartree
pointgroup: C01 [X(C23H33Cl1O2)]
dipole: -0.6787226 -1.2082255 -0.2299352 debye
polarizability: 334.2660095|-1.7314275|242.2971874|-16.5083385|-0.2061009|205.4964138 unknown
InChI: InChI=1S/C23H33ClO2/c1-5-23(14(2)25)11-8-18-16-13-20(24)19-12-15(26)6-9-21(19,3)17(16)7-10-22(18,23)4/h12-13,15-18,26H,5-11H2,1-4H3
charge 0 multiplicity 1
59 atoms
Cl 3.420344 3.432523 -0.374448
O  -5.404407 0.210658 1.107411
O  6.140496 -1.179757 -0.463423
C  -2.039175 -0.300247 0.416856
C  -1.112098 0.882151 -0.036537
C  -3.410931 0.098093 -0.338301
C  0.288616 0.807648 0.618873
C  0.976811 -0.527809 0.192405
C  -1.34251 -1.631798 0.024832
C  -1.981362 2.136089 0.175944
C  -3.408242 1.672235 -0.255157
C  0.097327 -1.733888 0.611585
C  2.483044 -0.547413 0.676301
C  -2.301984 -0.281107 1.951913
C  -3.435191 -0.397224 -1.823797
C  1.152928 2.018089 0.320137
C  -4.637746 -0.499893 0.401247
C  3.179495 0.607299 -0.085863
C  3.21626 -1.9005 0.407526
C  2.58313 -0.276511 2.210383
C  2.473019 1.895686 0.019399
C  3.835294 -2.021557 -0.99658
C  -4.691744 0.01399 -2.626092
C  4.29809 0.447086 -0.859002
C  4.875982 -0.904335 -1.208577
C  -4.921584 -1.996074 0.263901
H  -0.951717 0.770433 -1.131153
H  0.135199 0.790027 1.720473
H  1.006994 -0.525009 -0.920725
H  -1.266117 -1.707053 -1.077495
H  -1.924396 -2.508907 0.371056
H  -1.635314 2.997157 -0.422681
H  -1.963706 2.448245 1.237803
H  -4.182804 2.010181 0.453579
H  -3.664142 2.100789 -1.239576
H  0.055152 -1.816645 1.714935
H  0.542563 -2.676443 0.242474
H  -2.874277 0.608441 2.263964
H  -2.889467 -1.168348 2.253728
H  -1.36802 -0.303056 2.537641
H  -3.348303 -1.499897 -1.850386
H  -2.53936 -0.003666 -2.342754
H  0.687264 3.00864 0.367056
H  2.534022 -2.743892 0.611413
H  4.037547 -2.003156 1.146262
H  2.133237 0.684999 2.505739
H  2.086539 -1.08624 2.777068
H  3.643558 -0.251047 2.520713
H  4.334556 -3.000453 -1.11428
H  3.059471 -1.94406 -1.784072
H  -5.621624 -0.363376 -2.16162
H  -4.790362 1.110694 -2.708987
H  -4.641208 -0.393126 -3.652502
H  4.767625 1.328173 -1.31244
H  5.216868 -0.899555 -2.258813
H  -5.41461 -2.196692 -0.706569
H  -4.00079 -2.602377 0.290647
H  -5.606898 -2.309464 1.067228
H  6.022058 -0.870355 0.470836
