program: Gaussian 09
title: 000198782
version: EM64L-G09RevD.01
frameworkgroup: C1[X(C27H24O7)]
method: RPBEPBE
basis: SDD
operation: Freq
keyword: #pfreq=noraman
keyword: PBEPBE/SDD
title: #p freq=noraman PBEPBE/SDD
converged: YES YES NO NO
title: Mulliken charges:
elementType: O O O O O O O C C C C C C C C C C C C C C C C C C C C C C C C C C C H H H H H H H H H H H H H H H H H H H H H H H H
charge: -0.427836 -0.392496 -0.458523 -0.296483 -0.194879 -0.373622 -0.419729 -0.305628 0.134956 -0.649646 0.392396 0.383941 -0.022319 -0.092948 -0.626196 0.025891 -0.668473 0.340256 0.592371 0.220263 -0.580605 -0.673989 -0.380076 0.037715 -0.306009 0.162861 0.356784 -0.334256 -0.360242 0.211628 -0.630122 0.359985 -0.574651 -0.693432 0.304469 0.237078 0.256617 0.343481 0.250583 0.210651 0.207053 0.226749 0.211478 0.206767 0.340805 0.188920 0.188100 0.389012 0.198639 0.197035 0.294969 0.365818 0.252034 0.209501 0.218325 0.210595 0.364130 0.370305
chargesum: 0.00000
title: Mulliken charges with hydrogens summed into heavy atoms:
elementType: O O O O O O O C C C C C C C C C C C C C C C C C C C C C C C C C C C
charge: -0.087031 -0.003484 -0.092705 -0.296483 -0.194879 -0.009492 -0.049424 -0.001160 0.134956 -0.155952 0.392396 0.383941 -0.022319 -0.092948 -0.282714 0.025891 -0.417890 0.340256 0.592371 0.220263 -0.162901 -0.447240 0.038169 0.037715 -0.306009 0.162861 0.356784 0.042764 0.035431 0.211628 -0.335153 0.359985 -0.322617 -0.055010
polarizability: 6.58466202e+02 -1.92332106e+01 3.53953787e+02 2.30644577e+01 -4.04308016e+00 1.65314907e+02
1716.lowfreq: -0.0014 0.0010 0.0015 2.8225 4.9078 7.6285 16.1891 19.8847 33.4844
frequency: 15.8988 19.5025 33.4780 35.4978 52.4868 57.0900 65.8101 74.5910 96.6664 102.3322 109.0342 132.1713 136.1153 142.3753 159.9639 176.0247 197.8848 201.3356 211.5796 217.9862 232.2268 233.7192 240.4078 266.0055 285.6862 294.2274 308.9371 316.0696 321.4271 327.9394 351.1413 358.2445 375.1326 384.3218 388.9319 408.1479 417.5424 429.9114 432.7866 449.7280 455.2911 474.1131 489.2220 503.1089 515.6284 520.1408 538.1211 545.3268 555.3707 565.1993 589.0537 594.0358 606.9957 619.3257 621.4334 662.2600 688.8252 694.2036 716.1174 727.6999 731.9781 751.4906 755.1168 759.5424 784.9747 811.3939 834.3707 840.7984 841.8515 844.8165 850.2978 854.9248 884.5644 892.3866 903.2842 949.7586 954.7855 957.5916 961.0332 972.4162 988.4833 990.1414 994.6863 1002.9429 1010.7175 1045.8492 1050.2045 1076.1307 1077.8624 1095.1207 1106.0330 1111.8753 1143.3022 1156.0950 1157.8974 1177.7384 1183.0209 1190.6767 1198.3570 1205.3587 1215.5205 1228.1694 1240.8388 1244.9226 1250.9457 1258.4025 1271.0738 1287.6172 1289.8005 1293.4685 1299.2896 1315.5259 1326.5113 1329.7101 1336.7487 1349.7325 1352.6831 1359.3024 1381.7227 1382.8039 1389.9755 1397.9194 1418.4387 1423.0275 1430.6553 1433.1926 1440.0018 1454.2227 1465.3143 1466.6715 1474.7846 1477.8079 1478.3060 1483.7719 1489.8531 1494.1134 1536.1415 1553.6973 1555.6916 1586.4153 1594.8140 1605.3175 1621.4261 1633.9894 2582.2543 2953.5977 2967.3228 2967.5711 2971.9824 2973.2123 2980.6906 2993.3763 3014.2965 3028.2960 3049.7301 3055.5009 3069.6224 3073.4438 3100.7951 3104.3736 3123.5046 3134.7125 3145.3166 3209.0721 3531.3676 3536.7180 3574.0917 3580.9108
redmass: 5.3618 4.7839 6.6224 6.3464 1.7627 6.0313 6.1691 4.5443 3.9840 3.1739 6.4212 1.9353 7.9011 4.2171 7.7309 5.7950 5.6078 6.2617 4.5699 4.4575 4.0351 1.1968 6.2636 4.1971 3.7392 4.6999 4.0303 2.2466 1.6132 5.8048 3.3666 4.7726 3.3065 1.4445 4.2930 1.1372 3.8892 4.2459 1.2936 6.8743 7.9166 7.5625 4.7447 5.8610 5.6029 5.3957 5.9746 4.7472 6.3016 6.1473 5.2005 5.1316 7.0410 4.4502 4.3718 4.6650 4.2607 5.4481 5.7254 1.0682 4.6398 5.6127 1.5752 2.3031 6.3739 4.1690 2.6226 2.8599 1.5153 1.7760 2.3164 2.7977 1.5123 1.9789 1.7892 4.8662 1.4993 3.1259 1.9602 2.6041 2.7397 1.2118 4.3453 4.3969 3.3597 3.1867 2.3432 3.1556 2.3989 1.4063 2.7939 2.5103 1.6759 1.5594 1.3409 1.5952 1.3066 1.7866 1.5797 1.7831 1.5016 1.7332 1.2860 1.9171 1.4770 1.3434 2.1517 1.1273 1.6819 1.1567 1.7749 2.9290 5.5040 5.5487 1.4656 2.6356 1.6221 3.8483 1.4191 2.3419 1.2151 5.6326 5.2119 5.4051 1.6649 2.0011 3.9687 4.2280 1.0724 1.0831 1.0798 1.0438 4.0464 1.0833 1.0952 3.6112 6.0499 3.9143 6.9203 6.2073 6.4434 4.8720 6.8569 6.1784 1.0736 1.0589 1.0592 1.0658 1.0566 1.0389 1.0592 1.0983 1.1010 1.1036 1.1047 1.0944 1.1008 1.0993 1.0910 1.0874 1.0917 1.0920 1.0925 1.0912 1.0659 1.0657 1.0659 1.0661
irintensity: 0.3874 0.0970 1.7925 0.2510 0.1324 0.4122 0.0838 0.6433 0.5733 0.3916 0.7285 0.0451 0.1988 0.2607 1.4147 2.0059 1.5804 1.0727 1.4642 1.7964 1.5016 0.1328 2.3376 5.0163 4.8445 3.7896 8.0175 60.9490 58.2552 16.7465 10.4262 0.5053 29.9375 77.6232 11.2147 79.6074 2.6829 39.1010 189.9642 3.3650 5.5275 8.7691 7.6681 14.3151 2.4323 4.3222 11.5951 23.0981 5.4100 1.9993 7.9789 6.5847 5.6252 8.6237 4.2593 11.3464 0.9661 3.7094 1.2136 8.9460 20.2733 2.5706 9.2551 12.7982 1.9701 5.0462 29.6135 25.8032 13.2817 12.2705 27.8604 13.1079 1.4719 5.8108 13.7852 30.8921 15.7650 33.0068 13.8748 21.8962 83.6571 84.6779 18.4097 15.4832 115.6627 0.9638 17.3580 98.3166 3.0096 4.9170 55.8990 61.4391 246.1320 168.7505 80.8013 19.0634 36.2364 24.8167 0.9777 14.6096 16.7465 59.2915 9.9016 31.7507 24.8231 8.2158 122.8925 11.2440 38.2201 4.7611 43.2340 14.4787 875.5979 253.6314 21.8924 95.6811 2.9388 157.6094 34.5531 8.4623 11.2347 87.5340 52.3039 18.6129 28.6707 18.9867 20.6603 88.8100 0.8281 0.0163 4.7873 13.1131 25.7159 0.4367 23.1030 3.1015 279.4815 127.3535 1.8436 50.6716 311.9626 219.5926 91.2255 82.9175 284.5210 13.1121 15.3252 15.5023 22.9211 41.5443 105.8806 1.4065 2.1386 7.9113 56.9045 19.1617 91.2903 52.0312 19.8411 5.3943 17.1495 9.9956 6.4365 8.7918 10.7471 43.4471 31.8513 95.1156
temp: 298.150 k
press: 1.00000 atm
elementType: 8 8 8 8 8 8 8 6 6 6 6 6 6 6 6 6 6 6 6 6 6 6 6 6 6 6 6 6 6 6 6 6 6 6 1 1 1 1 1 1 1 1 1 1 1 1 1 1 1 1 1 1 1 1 1 1 1 1
symmnumber: 1
zpe: 1175234.1 jmol-1
zpe.correction: 0.447623 hartree
zpe.thermalcorrener: 0.478082 hartree
zpe.thermalcorrenthalpy: 0.479026 hartree
zpe.thermalcorrgfe: 0.385424 hartree
zpe.sumelectzpe: -1567.464200 hartree
zpe.sumelectthermal: -1567.433741 hartree
zpe.sumelectthermalent: -1567.432797 hartree
zpe.sumelectthermalfe: -1567.526399 hartree
dipole: -1.5268 -5.1583 -1.0873
dipole: 5.4883
quadrupole: -138.0260 -199.2330 -200.7675
quadrupole: -2.5559 3.3337 -9.5141
quadrupole: 41.3161 -19.8909 -21.4253 -2.5559 3.3337 -9.5141
hfenergy: -1567.9118234 hartree
pointgroup: C01 [X(C27H24O7)]
dipole: -0.5933726 -2.0083444 -0.5261279 debye
polarizability: 659.1529647|-18.3273582|353.6074952|16.4650147|6.1266488|164.9744369 unknown
InChI: InChI=1S/C27H24O7/c1-2-3-4-5-12-6-13-8-19(30)22-15(21(13)18(29)7-12)11-17-24(26(22)33)27(34)23-16(25(17)32)9-14(28)10-20(23)31/h6-7,9-11,19,28-31,33H,2-5,8H2,1H3
charge 0 multiplicity 1
58 atoms
O  -1.655262 2.768048 1.442079
O  1.625794 3.235715 0.217894
O  -1.613407 -2.48745 0.283304
O  4.029907 2.570608 0.291782
O  2.66756 -2.757586 -0.26578
O  6.607096 1.871807 0.377701
O  7.749276 -2.787631 0.005915
C  -1.129186 2.626648 0.060244
C  -0.064645 1.54603 -0.008418
C  -2.253114 2.30252 -0.9361
C  -0.443277 0.180967 -0.170365
C  -2.795337 0.898095 -0.72269
C  -1.888046 -0.142465 -0.329603
C  1.30878 1.906639 0.096642
C  0.581116 -0.812275 -0.199881
C  2.335122 0.903065 0.063975
C  -4.165967 0.636796 -0.917145
C  1.936903 -0.460089 -0.085321
C  -4.7066 -0.661746 -0.745142
C  -2.452105 -1.441788 -0.140782
C  -6.191639 -0.92276 -0.929767
C  -3.82673 -1.693565 -0.351977
C  -7.030375 -0.542671 0.324006
C  3.745511 1.306917 0.169636
C  2.969347 -1.52768 -0.131141
C  4.79003 0.265574 0.131564
C  4.412359 -1.110228 -0.01452
C  -8.543051 -0.778532 0.1198
C  -9.389581 -0.40357 1.357948
C  6.193186 0.552952 0.23306
C  5.369148 -2.141781 -0.058812
C  6.740252 -1.823069 0.042527
C  7.152259 -0.484479 0.1882
C  -10.900713 -0.637881 1.143869
H  -0.683539 3.610974 -0.140556
H  -1.846845 2.396584 -1.96511
H  -3.060825 3.04838 -0.832642
H  0.32994 -1.866499 -0.311674
H  -4.826509 1.460219 -1.214398
H  -6.569986 -0.340554 -1.793228
H  -6.365757 -1.991326 -1.162945
H  -4.216763 -2.710623 -0.204456
H  -6.849151 0.522246 0.573022
H  -6.672822 -1.130849 1.19318
H  -2.035152 1.894194 1.72254
H  -8.892627 -0.189249 -0.753941
H  -8.720194 -1.844812 -0.134459
H  2.67187 3.279304 0.283075
H  -9.211229 0.660956 1.612323
H  -9.041628 -0.993702 2.230105
H  5.0077 -3.170495 -0.173473
H  -2.131886 -3.319622 0.416714
H  8.224128 -0.269207 0.265198
H  -11.109113 -1.700278 0.915406
H  -11.484087 -0.364934 2.042229
H  -11.279529 -0.033156 0.29833
H  7.59624 1.920356 0.439528
H  7.370653 -3.69604 -0.098974
