program: Gaussian 09
title: 000198730
version: EM64L-G09RevD.01
frameworkgroup: C1[X(C13H14N2O2)]
method: RPBEPBE
basis: SDD
operation: Freq
keyword: #p
keyword: freq=noraman
keyword: PBEPBE/SDD
title: #p freq=noraman PBEPBE/SDD
converged: YES YES NO NO
title: Mulliken charges:
elementType: O O N N C C C C C C C C C C C C C H H H H H H H H H H H H H H
charge: -0.211923 -0.240229 -0.384924 -0.084973 -0.001983 0.334695 0.314247 0.078579 -0.434648 -0.399925 -0.219690 -0.816693 -0.818525 0.205445 -0.452379 0.352307 -0.764435 0.237908 0.235899 0.229615 0.221601 0.268992 0.228227 0.248456 0.235882 0.234679 0.336045 0.315275 0.252957 0.246831 0.252687
chargesum: 0.00000
title: Mulliken charges with hydrogens summed into heavy atoms:
elementType: O O N N C C C C C C C C C C C C C
charge: -0.211923 -0.240229 -0.048879 -0.084973 -0.001983 0.334695 0.314247 0.078579 -0.196739 -0.164027 0.009924 -0.097873 -0.099509 0.205445 -0.137103 0.352307 -0.011960
polarizability: 2.38231741e+02 1.75654572e+00 1.51176259e+02 7.16446229e+00 4.55160970e+00 1.01178076e+02
1716.lowfreq: -12.8213 -9.1093 -2.8256 0.0007 0.0007 0.0010 28.6005 33.6113 56.4854
frequency: 28.2980 33.5584 56.4637 80.7484 95.5151 116.2324 120.5620 132.1487 162.0881 168.6281 216.0502 231.5138 250.7538 288.3977 326.5286 363.2393 370.8229 405.6521 436.5055 508.5527 519.5114 522.7945 575.6651 584.2155 615.1546 656.6387 686.2405 702.8567 716.4225 755.6926 782.3321 785.6573 832.1361 865.0817 882.4800 904.7014 919.2277 923.2176 980.8729 984.4116 990.9907 995.2333 1039.5851 1043.1111 1048.0592 1050.1658 1071.4697 1109.8264 1134.0256 1179.2068 1218.9660 1239.2642 1257.1253 1264.1282 1350.8224 1360.0401 1402.5390 1404.3720 1405.7262 1428.6519 1449.3374 1456.3086 1462.4589 1463.4412 1476.3001 1476.4672 1481.6533 1482.3601 1509.0801 1584.1846 1602.0697 1604.3211 1606.9470 2975.7200 2986.2459 2994.4402 3058.4548 3068.5865 3075.1956 3092.8501 3093.3922 3114.1987 3123.0235 3134.0348 3157.3253 3278.0815 3525.7379
redmass: 5.2784 4.2289 4.4382 1.2560 3.0099 3.1092 1.1094 1.0972 3.7919 3.9336 2.9261 4.1107 4.0638 4.8039 3.1477 5.6455 4.9084 4.2242 3.1349 4.3489 4.8290 3.4599 4.4869 5.8430 4.4544 1.4407 3.0287 4.1133 6.6061 5.3216 1.8855 2.1331 7.7592 1.2956 6.7550 1.3104 2.7685 4.5845 3.6307 1.5326 1.5927 1.6808 1.6639 1.6551 1.5555 1.4945 2.9420 1.7738 2.2164 1.1730 3.0944 2.7194 1.8950 2.6086 4.9699 7.9589 1.2260 1.2331 1.2153 2.3902 1.9964 1.0427 1.2650 1.0759 1.2303 1.4147 1.2395 1.4823 3.7224 6.9317 5.8173 5.9661 7.4788 1.0415 1.0372 1.0374 1.0922 1.0964 1.0981 1.0999 1.1002 1.0987 1.0859 1.0918 1.0996 1.1002 1.0767
irintensity: 0.2312 2.4118 0.5773 1.0538 11.9677 5.2973 0.2344 1.0628 4.6168 2.5973 0.0231 2.0079 7.0823 4.2654 1.7437 0.1798 2.7890 8.0080 2.1138 6.8561 1.8269 0.2757 7.2088 0.3057 3.6551 62.2222 8.3133 34.8157 14.9526 3.3190 34.1487 24.1200 34.9414 37.6367 5.2387 0.0555 2.1812 2.3558 5.3828 0.3144 1.8946 11.8736 5.3229 3.3697 5.8001 9.0075 25.6003 3.3518 2.6653 2.7820 18.2815 63.1538 0.5993 6.2928 158.4988 0.7794 21.0209 21.1585 8.1332 63.7413 6.3946 16.4888 13.3307 18.0963 32.9448 36.4144 34.9247 25.3467 409.8158 26.4104 20.0688 182.1410 107.6814 24.2439 19.8045 16.5979 18.8147 15.1961 9.6592 15.1334 25.1870 8.4313 0.2752 22.9693 33.8488 8.0157 25.7005
temp: 298.150 k
press: 1.00000 atm
elementType: 8 8 7 7 6 6 6 6 6 6 6 6 6 6 6 6 6 1 1 1 1 1 1 1 1 1 1 1 1 1 1
symmnumber: 1
zpe: 639482.3 jmol-1
zpe.correction: 0.243566 hartree
zpe.thermalcorrener: 0.260151 hartree
zpe.thermalcorrenthalpy: 0.261095 hartree
zpe.thermalcorrgfe: 0.198036 hartree
zpe.sumelectzpe: -762.485659 hartree
zpe.sumelectthermal: -762.469075 hartree
zpe.sumelectthermalent: -762.468131 hartree
zpe.sumelectthermalfe: -762.531189 hartree
dipole: -0.8300 0.1631 0.4041
dipole: 0.9375
quadrupole: -81.2397 -96.2421 -106.6603
quadrupole: 9.0838 11.1551 -6.0341
quadrupole: 13.4743 -1.5281 -11.9463 9.0838 11.1551 -6.0341
hfenergy: -762.7292254 hartree
pointgroup: C01 [X(C13H14N2O2)]
dipole: -0.3293791 0.0305651 0.1631122 debye
polarizability: 237.2678157|-7.1082816|143.7345386|11.6931452|18.126642|109.5837217 unknown
InChI: InChI=1S/C13H14N2O2/c1-8-5-4-6-9(2)12(8)13(16)14-11-7-10(3)17-15-11/h4-7,14H,1-3H3
charge 0 multiplicity 1
31 atoms
O  4.105684 -0.718984 -1.012564
O  0.150562 0.733923 1.607487
N  0.624584 -0.218801 -0.473736
N  2.70566 -0.794015 -1.435872
C  -1.717326 0.134801 0.137348
C  -2.502323 1.329102 0.108812
C  -2.305249 -1.142494 -0.111392
C  -0.257432 0.24662 0.511939
C  -3.876595 1.225953 -0.212217
C  -3.688867 -1.201473 -0.415279
C  -4.468629 -0.028661 -0.475208
C  -1.893112 2.686966 0.412438
C  -1.511687 -2.441097 -0.031956
C  2.021184 -0.2816 -0.374747
C  2.877947 0.122082 0.711351
C  4.160215 -0.16576 0.278526
C  5.519551 -0.013796 0.879244
H  -4.484728 2.136929 -0.24908
H  -4.153134 -2.177966 -0.596273
H  -5.535847 -0.091742 -0.715289
H  -2.617841 3.494441 0.214301
H  -1.576287 2.74671 1.468557
H  -0.990032 2.879231 -0.196234
H  -0.737253 -2.412046 0.753601
H  -2.1854 -3.286701 0.188389
H  -1.000232 -2.677831 -0.985518
H  0.225041 -0.557871 -1.353283
H  2.555807 0.556399 1.651027
H  6.158782 0.637701 0.256728
H  5.440514 0.430568 1.883911
H  6.026544 -0.991489 0.967388
