program: Gaussian 09
title: 000198705
version: EM64L-G09RevD.01
frameworkgroup: C1[X(C11H12O4)]
method: RPBEPBE
basis: SDD
operation: Freq
keyword: #pfreq=noraman
keyword: PBEPBE/SDD
title: #p freq=noraman PBEPBE/SDD
converged: YES YES NO NO
title: Mulliken charges:
elementType: O O O O C C C C C C C C C C C H H H H H H H H H H H H
charge: -0.237367 -0.186819 -0.165057 -0.165067 0.162371 0.162240 -0.210804 -0.210733 -0.539325 -0.539345 -0.448434 -0.448464 -0.439523 0.147329 0.147420 0.287747 0.287719 0.248038 0.245007 0.245029 0.248049 0.247998 0.223014 0.223019 0.247986 0.241104 0.226868
chargesum: 0.00000
title: Mulliken charges with hydrogens summed into heavy atoms:
elementType: O O O O C C C C C C C C C C C
charge: -0.237367 -0.186819 -0.165057 -0.165067 0.162371 0.162240 0.076943 0.076986 -0.046281 -0.046267 0.022578 0.022541 0.028449 0.147329 0.147420
polarizability: 1.14840630e+02 -3.79218345e-03 1.25558612e+02 -1.47600628e+00 1.41121514e-02 1.00946663e+02
1716.lowfreq: -7.6591 -0.0003 0.0006 0.0008 11.2107 13.4724 78.6045 128.2800 167.5848
frequency: 78.5365 128.2800 167.5848 183.2221 198.3064 234.5959 265.5328 282.4297 312.0990 316.8843 419.3546 481.5852 501.7629 544.2418 554.6947 579.5176 623.7616 669.2511 687.5253 689.3723 739.9567 770.4312 801.2693 803.0513 829.2249 832.6548 859.5187 882.9018 903.5679 916.6683 925.7674 929.6710 976.4862 1005.9810 1014.6363 1034.0961 1040.7824 1054.3963 1087.3599 1125.1356 1150.0397 1158.8658 1159.0867 1181.1876 1197.7233 1206.2032 1215.9986 1222.7795 1236.2141 1264.8987 1276.4168 1284.1605 1303.6197 1308.1905 1317.8601 1324.4054 1463.1661 1469.2057 1477.4250 1477.6634 1496.8788 1691.7829 1761.1796 3011.1898 3014.1245 3017.8574 3033.9753 3045.0305 3062.4254 3071.2696 3084.7258 3088.2024 3107.4319 3117.6579 3124.2846
redmass: 6.3821 14.7611 6.3707 3.7986 2.7115 2.6229 2.2304 1.9895 4.1230 6.4041 3.7381 6.6101 4.3896 5.6415 4.5611 9.5008 2.3037 8.4866 6.5787 6.3193 4.4658 5.0346 1.9893 2.2074 7.7690 1.9201 2.1921 3.3140 4.9097 2.7161 2.7031 2.5140 2.7766 2.6010 2.2658 1.5421 2.4293 2.9155 2.4539 3.7244 4.2314 2.7728 1.7548 1.5635 1.2829 1.5719 1.4999 1.2832 1.4002 1.5975 1.3992 1.4434 1.3839 1.4423 1.2473 1.4353 1.0804 1.0948 1.0788 1.0775 1.0890 13.0567 12.8773 1.0589 1.0615 1.0673 1.0588 1.0620 1.0998 1.1028 1.1046 1.1041 1.1044 1.0888 1.0945
irintensity: 0.0961 3.1845 1.8886 0.2424 0.1831 1.8757 1.4153 0.9354 0.3619 6.6118 4.6718 13.6007 8.6745 4.3277 5.1656 0.8829 6.6432 11.0447 0.1288 3.5285 1.2176 11.2983 6.1566 47.3982 156.0654 24.0153 14.9083 148.3404 3.7414 1.2695 11.8816 2.6652 3.5462 46.8557 1.1640 8.3867 6.9086 4.5939 66.9003 5.7889 86.7945 18.0956 16.2637 1.3963 0.0213 10.5178 11.6362 0.1295 14.1587 0.1068 0.7131 3.0433 0.4372 2.0449 0.3385 1.8961 0.0003 7.2158 12.2377 22.7085 21.4928 449.2690 117.4613 18.0469 27.1898 18.4069 22.2052 28.0037 14.0301 7.1265 50.7251 0.8173 28.5510 15.2393 5.3119
temp: 298.150 k
press: 1.00000 atm
elementType: 8 8 8 8 6 6 6 6 6 6 6 6 6 6 6 1 1 1 1 1 1 1 1 1 1 1 1
symmnumber: 1
zpe: 561498.5 jmol-1
zpe.correction: 0.213863 hartree
zpe.thermalcorrener: 0.225274 hartree
zpe.thermalcorrenthalpy: 0.226218 hartree
zpe.thermalcorrgfe: 0.177198 hartree
zpe.sumelectzpe: -726.148442 hartree
zpe.sumelectthermal: -726.137032 hartree
zpe.sumelectthermalent: -726.136088 hartree
zpe.sumelectthermalfe: -726.185108 hartree
dipole: -6.6096 -0.0040 3.4997
dipole: 7.4790
quadrupole: -95.3148 -94.2895 -86.1224
quadrupole: -0.0023 3.7324 -0.0034
quadrupole: -3.4059 -2.3806 5.7865 -0.0023 3.7324 -0.0034
hfenergy: -726.3623057 hartree
pointgroup: C01 [X(C11H12O4)]
dipole: -2.5216699 -0.0003175 1.5163196 debye
polarizability: 114.6391418|-0.0033287|125.5586209|-2.2220361|-0.0015484|101.1481423 unknown
InChI: InChI=1S/C11H12O4/c12-8-10-4-1-5-11(10,9(13)15-8)7-3-2-6(10)14-7/h6-7H,1-5H2
charge 0 multiplicity 1
27 atoms
O  -0.679546 0.000372 -1.884572
O  2.252002 0.000111 -0.429568
O  1.924917 2.31016 -0.388846
O  1.925309 -2.309989 -0.389177
C  0.04406 0.783281 0.224401
C  0.044087 -0.783511 0.223925
C  -0.981296 1.109241 -0.920577
C  -0.98153 -1.108796 -0.920997
C  -0.268445 1.240959 1.680104
C  -0.26804 -1.242048 1.679437
C  -2.436409 0.786368 -0.492898
C  -2.436527 -0.78572 -0.493029
C  -0.900876 -0.000835 2.375271
C  1.450471 1.184239 -0.222902
C  1.450351 -1.184151 -0.224136
H  -0.819235 2.072768 -1.421829
H  -0.81975 -2.07216 -1.422651
H  -0.923765 2.128584 1.705599
H  0.669437 1.524585 2.191352
H  0.670001 -1.525603 2.190431
H  -0.923057 -2.129906 1.704557
H  -3.135284 1.183473 -1.246873
H  -2.70574 1.222935 0.482678
H  -2.70581 -1.222402 0.48251
H  -3.135571 -1.182572 -1.246981
H  -0.709077 -0.001092 3.462585
H  -1.997679 -0.000989 2.243287
