program: Gaussian 09
title: 000198709
version: EM64L-G09RevD.01
frameworkgroup: C1[X(C8H7BrN4)]
method: RPBEPBE
basis: SDD
operation: Freq
keyword: #p
keyword: freq=noraman
keyword: PBEPBE/SDD
title: #p freq=noraman PBEPBE/SDD
converged: NO YES NO NO
title: Mulliken charges:
elementType: Br N N N N C C C C C C C C H H H H H H H
charge: -0.012012 -0.101503 -0.126820 -0.604245 -0.589646 0.317267 0.104872 0.149570 -0.321034 -0.356595 -0.236618 -0.211991 -0.051545 0.263755 0.251425 0.237159 0.301784 0.329805 0.327514 0.328857
chargesum: 0.00000
title: Mulliken charges with hydrogens summed into heavy atoms:
elementType: Br N N N N C C C C C C C C
charge: -0.012012 -0.101503 -0.126820 0.027344 0.066725 0.317267 0.104872 0.149570 -0.321034 -0.092840 0.014807 0.025168 -0.051545
polarizability: 2.07717540e+02 6.41353649e+00 1.63643961e+02 5.59441610e-02 -4.33803397e-03 4.93057795e+01
1716.lowfreq: -0.0007 -0.0005 -0.0003 6.1501 8.4296 10.6228 40.2374 123.0950 171.0757
frequency: 40.2310 123.0937 171.0757 194.7053 202.5983 251.0729 290.4424 316.2272 342.5879 455.1216 464.2443 465.2610 500.3259 523.7768 532.9647 537.6336 561.4591 569.1181 579.0555 675.3312 679.7405 719.0478 747.8597 773.5867 805.6648 860.9809 894.5618 924.5358 982.3981 1034.8632 1055.8245 1106.5605 1135.8562 1154.6230 1199.1372 1300.7540 1332.6933 1355.0194 1380.5500 1437.8603 1463.8055 1502.1013 1537.6749 1542.9145 1600.9219 1608.9146 1626.6951 3145.1859 3174.0782 3183.4524 3506.1573 3564.0263 3665.2970 3723.7575
redmass: 5.9589 5.2243 12.6229 6.1086 5.0476 8.6364 5.9103 3.5173 3.5254 1.2126 3.2255 7.2194 7.0130 1.1469 1.0870 3.3032 2.5079 7.1938 1.5717 3.5979 6.5357 7.1579 5.8042 1.7984 3.5841 7.2456 1.4331 2.8136 1.3306 2.9488 2.5128 2.5916 1.5906 1.6618 1.6851 3.5084 5.7286 2.9383 3.1488 3.6571 3.9178 2.9497 5.2298 4.9319 1.5587 2.6897 2.3389 1.0878 1.0926 1.0988 1.0458 1.0441 1.1046 1.1058
irintensity: 0.0962 3.7821 1.5811 9.5494 3.8826 1.6719 0.3237 8.9228 10.6589 269.4877 0.2882 0.8111 6.3813 139.1346 22.5941 0.1356 45.7177 2.3043 70.2123 51.9457 6.9580 27.0953 17.0601 18.7912 45.1774 74.9105 2.1294 3.3866 1.1849 8.1466 8.9864 17.8731 5.1580 0.9755 21.3423 0.1262 15.3597 27.8710 64.6515 0.7484 39.7554 34.1145 242.2733 533.8353 654.8341 292.4959 127.4259 9.6541 3.5359 8.1758 94.4896 142.4357 101.9812 45.6731
temp: 298.150 k
press: 1.00000 atm
elementType: 35 7 7 7 7 6 6 6 6 6 6 6 6 1 1 1 1 1 1 1
symmnumber: 1
zpe: 379954.5 jmol-1
zpe.correction: 0.144717 hartree
zpe.thermalcorrener: 0.155672 hartree
zpe.thermalcorrenthalpy: 0.156616 hartree
zpe.thermalcorrgfe: 0.107132 hartree
zpe.sumelectzpe: -540.639209 hartree
zpe.sumelectthermal: -540.628255 hartree
zpe.sumelectthermalent: -540.627311 hartree
zpe.sumelectthermalfe: -540.676794 hartree
dipole: -0.4132 -1.0509 0.0073
dipole: 1.1293
quadrupole: -72.1412 -71.0206 -89.7982
quadrupole: 4.4964 -0.0253 -0.0134
quadrupole: 5.5121 6.6328 -12.1448 4.4964 -0.0253 -0.0134
hfenergy: -540.7839263 hartree
pointgroup: C01 [X(C8H7Br1N4)]
dipole: 0.305071 -0.3229387 0.0059791 debye
dipolederiv: -0.4431532 -0.2965832 -0.005652 -0.4268359 -0.5922991 -0.0042897 -0.0037611 -0.0008597 -0.0446398 -1.6394863 -0.0318419 -0.0300213 0.4330394 -0.6339305 0.0127732 -0.0338809 0.0018123 -0.267337 -1.0602976 -0.5166299 -0.0140532 -0.3147633 -0.795914 -0.0045842 -0.0157821 -0.0087322 -0.2824345 -0.398187 -0.2381122 0.0070623 -0.1458782 -1.3287048 -0.0005934 0.0068805 -0.0018815 -0.663051 -1.8656286 -0.1294934 -0.0257461 -0.2002511 -0.1890384 -0.0087629 -0.031579 -0.007329 -0.7298653 -0.7349481 0.2747827 -0.0190001 -0.3426136 -0.7183517 -0.0015901 -0.0143823 0.0117499 0.0691277 1.188761 0.0291684 0.02431 0.1158159 0.2152991 0.0014773 0.024016 0.0002247 0.0786017 0.9673492 0.32961 0.015222 0.0456312 1.570734 -0.0061101 0.0165142 -0.0014299 0.2031382 0.8324349 0.1726953 0.017383 0.7567493 1.018482 0.0055773 0.0123618 -0.0075473 -0.1038497 -0.3982066 -0.0346319 -0.0043191 0.2926153 0.08276 0.004591 -0.0063482 -0.0025862 -0.1869313 -0.2552829 0.0218537 -0.0026708 -0.1012481 -0.6107535 0.0017182 -0.0018961 0.0044185 -0.1406393 0.2577857 0.1720358 0.0069856 -0.0046791 0.2816553 -0.0029434 0.0083759 0.0004428 -0.1294041 2.4838553 0.2504773 0.0503966 -0.0872774 0.8673675 -0.0057519 0.0551084 0.0014353 0.2111878 0.060875 -0.0860512 -0.0016101 -0.0328928 -0.0232906 0.000561 -0.0020817 -0.000483 0.1629387 -0.0538831 -0.0166401 -0.0045482 -0.0326415 0.0934356 -0.0000695 -0.0040092 0.0004745 0.1720262 0.0137087 0.0930831 -0.0037482 0.0847557 -0.0589859 0.0034034 -0.0037343 0.0034309 0.1590861 0.3660095 -0.0129575 0.0002766 -0.0505137 0.2251305 0.0000902 0.000621 0.0016926 0.3417372 0.1260406 -0.0204462 -0.0051005 -0.0191901 0.2695985 0.000482 -0.0051894 0.0007065 0.3703448 0.2842499 -0.0051933 -0.0021528 -0.0658291 0.1622017 -0.0001495 0.0002054 0.0010394 0.3907757 0.2680038 0.0448746 -0.0030137 0.0960071 0.1646044 0.0041711 -0.0014388 0.0034214 0.3891879 unknown
polarizability: 205.9509701|10.6491311|165.3357138|3.283282|-0.6099699|49.3805973 unknown
InChI: InChI=1S/C8H7BrN4/c9-4-2-1-3-5-6(4)7(10)13-8(11)12-5/h1-3H,10-11H2
charge 0 multiplicity 1
20 atoms
Br -2.923326 -2.054796 -0.04461
N  1.48302 1.300721 0.021842
N  1.856934 -1.11056 0.047221
N  0.191555 -2.687335 0.019053
N  3.638596 0.394532 0.078845
C  -0.464133 -0.268521 -0.010178
C  0.120584 1.074487 -0.006666
C  0.524524 -1.356931 0.017192
C  -1.891812 -0.339615 -0.039249
C  -0.731024 2.224313 -0.032252
C  -2.714104 0.791607 -0.064843
C  -2.11674 2.085639 -0.061337
C  2.276893 0.202595 0.047129
H  -0.244651 3.203264 -0.028167
H  -3.801375 0.686548 -0.086327
H  -2.763485 2.96903 -0.081348
H  -0.77341 -3.010182 0.001857
H  0.966244 -3.348522 0.040573
H  4.254699 -0.412795 0.096374
H  4.002011 1.343321 0.077589
