program: Gaussian 09
title: 000017155
version: EM64L-G09RevD.01
frameworkgroup: C1[X(C9H8N2)]
method: RPBEPBE
basis: SDD
operation: Freq
keyword: #p
keyword: freq=noraman
keyword: PBEPBE/SDD
title: #p freq=noraman PBEPBE/SDD
converged: YES YES NO NO
title: Mulliken charges:
elementType: N N C C C C C C C C C H H H H H H H H
charge: -0.451380 -0.030521 0.377655 0.298494 -0.373575 -0.381995 -0.406435 -0.228553 -0.231904 -0.238537 -0.325068 0.237550 0.218960 0.252172 0.334559 0.229206 0.228975 0.232639 0.257757
chargesum: 0.00000
title: Mulliken charges with hydrogens summed into heavy atoms:
elementType: N N C C C C C C C C C
charge: -0.116821 -0.030521 0.377655 0.298494 -0.136025 -0.163035 -0.154263 0.000654 -0.002928 -0.005898 -0.067312
polarizability: 1.73896964e+02 -3.29882937e+00 1.06794932e+02 -1.22290127e+00 -3.89711671e-02 4.62750663e+01
1716.lowfreq: -10.7159 -9.2741 -0.0007 -0.0006 0.0002 0.2105 49.0908 106.4375 139.4057
frequency: 49.0852 106.4358 139.4027 281.6201 338.9504 402.3429 415.4641 502.6046 603.5595 615.2028 651.1470 672.4739 675.1530 698.5812 770.4750 800.7212 846.8358 869.0813 899.4424 917.3089 941.5177 974.5610 988.1496 996.3366 1025.3154 1039.7550 1068.0564 1082.1769 1088.5885 1174.6817 1193.7883 1221.2826 1275.2559 1319.0589 1323.2500 1376.3741 1386.9454 1420.9968 1445.3977 1475.3406 1560.6555 1586.9589 1618.8573 3119.3994 3129.8333 3141.8551 3152.5298 3167.9550 3222.0558 3243.5938 3614.1786
redmass: 3.7192 4.8417 4.5144 4.5876 6.7608 2.8066 4.5399 3.3740 1.9923 5.8846 2.0176 3.4320 4.2590 1.9375 1.6500 1.3440 1.2579 1.3867 5.4683 1.4515 5.8684 1.4316 5.4214 1.3233 2.4176 1.4318 3.3036 1.7231 2.4691 1.0539 1.1220 2.2013 2.3093 1.7194 2.2362 4.9569 2.2195 3.3695 2.5684 2.2677 4.6046 5.9171 6.0536 1.0870 1.0861 1.0916 1.0961 1.1016 1.0926 1.1050 1.0818
irintensity: 0.0571 0.0319 0.7851 0.2090 0.0455 0.0146 0.1125 6.8816 35.3998 1.1846 42.6077 4.4964 3.3195 42.8513 119.4848 55.6192 0.4095 1.2207 25.2917 5.0903 7.2877 0.3420 0.0879 0.2304 2.2789 26.6052 25.7338 4.7433 4.4926 0.0916 0.3627 0.9903 2.6637 9.9088 10.8207 0.2070 11.5594 2.5836 13.9081 41.9013 2.1184 2.0668 13.3413 10.3223 0.5171 14.4808 35.1603 18.8088 5.2469 2.0838 51.0089
temp: 298.150 k
press: 1.00000 atm
elementType: 7 7 6 6 6 6 6 6 6 6 6 1 1 1 1 1 1 1 1
symmnumber: 1
zpe: 392558.1 jmol-1
zpe.correction: 0.149517 hartree
zpe.thermalcorrener: 0.157851 hartree
zpe.thermalcorrenthalpy: 0.158795 hartree
zpe.thermalcorrgfe: 0.115404 hartree
zpe.sumelectzpe: -456.482631 hartree
zpe.sumelectthermal: -456.474298 hartree
zpe.sumelectthermalent: -456.473354 hartree
zpe.sumelectthermalfe: -456.516745 hartree
dipole: 2.7504 0.2260 0.0031
dipole: 2.7597
quadrupole: -66.2824 -54.0323 -69.1087
quadrupole: -4.5669 -1.2634 0.5496
quadrupole: -3.1412 9.1088 -5.9676 -4.5669 -1.2634 0.5496
hfenergy: -456.6321488 hartree
pointgroup: C01 [X(C9H8N2)]
dipole: -1.0825343 0.0835623 0.0029655 debye
dipolederiv: 0.0548926 -0.2008346 0.0391776 -0.2459781 -0.4267533 0.0414175 -0.0418562 0.0021965 -0.2107228 -0.5536436 0.2509571 -0.0619466 0.1282511 -0.158591 0.0008939 0.0299201 -0.0026986 -0.2156209 0.5539183 0.0441854 -0.0177683 0.0096395 -0.0065667 0.0192801 -0.0156119 0.002755 0.0637676 -0.0378312 -0.0179924 0.0178924 0.0986879 0.3049303 -0.1046396 0.0214756 -0.0486253 0.0292003 -0.221467 0.0471078 0.0164957 0.1331254 0.0329454 0.035117 0.0246536 0.0241508 -0.1528165 -0.1710868 -0.049468 -0.0236386 -0.1357109 0.0102895 0.0514026 -0.037172 0.044919 -0.1660325 -0.1876219 -0.0645129 0.0185466 -0.0549942 -0.1037497 -0.0438209 0.0529515 -0.043324 -0.2137926 0.0640134 -0.0716798 -0.0160902 -0.1039454 0.0980052 0.0348748 -0.0358035 0.0377374 -0.1371431 0.0110844 0.0568893 0.0077622 0.1313132 0.1028457 0.0326532 0.0310071 0.0409189 -0.1362067 -0.0081911 0.0046911 -0.0014644 -0.028648 -0.0927745 0.01135 -0.0075929 0.0098594 -0.16974 0.2343114 0.0364452 -0.0076036 0.0995149 0.0331301 -0.0431246 -0.0750674 -0.0430376 -0.1164731 0.0476752 -0.0973947 -0.0153457 -0.076249 -0.034085 -0.0313954 -0.0150186 -0.0250441 0.1451772 0.021251 0.1143074 0.0218178 0.0936482 -0.0442592 -0.0378725 0.0250656 -0.0332624 0.1431712 0.1172577 0.0716922 -0.017296 0.0525477 0.0006395 0.0594045 -0.0119643 0.0539417 0.1817698 0.2044613 -0.0548745 0.0118682 -0.0484774 0.2359143 0.0251254 0.0349236 0.030316 0.3116891 0.014448 0.0839844 0.0134455 0.1096958 -0.0589247 -0.0333292 0.0187282 -0.0327223 0.1526577 0.0232138 -0.0813058 -0.009204 -0.1060534 -0.0703169 -0.0323348 -0.0128898 -0.034191 0.1534624 -0.1308206 -0.0068565 0.0041405 -0.0070775 0.0913479 -0.0112562 0.005773 -0.0084711 0.16411 -0.0358649 -0.0653407 0.0192108 -0.0492898 0.085973 0.0262541 0.0084783 0.0245817 0.1735429 unknown
polarizability: 173.8495394|3.6222442|106.8276094|-1.7952142|-0.3299084|46.2898135 unknown
InChI: InChI=1S/C9H8N2/c1-2-4-8(5-3-1)9-6-7-10-11-9/h1-7,11H
charge 0 multiplicity 1
19 atoms
N  1.842974 -1.01724 0.252522
N  3.201376 -0.740254 0.185335
C  -0.436374 0.024231 -0.015831
C  1.033297 0.079265 -0.027148
C  -1.194484 1.21481 0.162149
C  -1.134347 -1.205525 -0.180924
C  1.929535 1.135539 -0.30274
C  -2.603683 1.176607 0.175199
C  -2.544505 -1.243264 -0.157136
C  -3.287132 -0.052905 0.02041
C  3.23697 0.583807 -0.165471
H  -0.67315 2.167058 0.308624
H  -0.580005 -2.134285 -0.363702
H  1.66898 2.149432 -0.597633
H  1.553144 -1.944863 0.554694
H  -3.170047 2.103977 0.314955
H  -3.064021 -2.198715 -0.289674
H  -4.381961 -0.082238 0.035067
H  4.201631 1.068662 -0.302696
