program: Gaussian 09
title: 000198690
version: EM64L-G09RevD.01
frameworkgroup: C1[X(C8H7ClN2O2S)]
method: RPBEPBE
basis: SDD
operation: Freq
keyword: #p
keyword: freq=noraman
keyword: PBEPBE/SDD
title: #p freq=noraman PBEPBE/SDD
converged: YES YES NO NO
title: Mulliken charges:
elementType: Cl S O O N N C C C C C C C C H H H H H H H
charge: -0.005496 0.910945 -0.494484 -0.495405 -0.151633 -0.165622 0.548364 -0.253870 -0.300891 -0.233554 -0.088311 -0.637997 -0.215640 -0.227991 0.260461 0.284859 0.252379 0.251093 0.269788 0.251091 0.241916
chargesum: 0.00000
title: Mulliken charges with hydrogens summed into heavy atoms:
elementType: Cl S O O N N C C C C C C C C
charge: -0.005496 0.910945 -0.494484 -0.495405 -0.151633 -0.165622 0.548364 -0.253870 -0.040431 0.051304 -0.088311 0.135263 0.026276 0.023100
polarizability: 1.90743967e+02 -5.24765105e+00 1.58077372e+02 3.37503035e+00 -2.77065951e+00 8.23651269e+01
1716.lowfreq: -7.4162 -0.0027 -0.0017 -0.0015 2.4352 3.2126 55.6949 86.4806 102.6946
frequency: 55.6857 86.4795 102.6893 129.6561 179.6852 188.9347 195.7024 238.6908 248.3603 282.6156 300.2569 332.7590 353.8397 379.6102 421.2150 462.4179 467.7807 512.9500 532.5441 560.4998 610.4589 648.0630 693.8751 728.7205 768.2318 780.7376 833.2641 865.7651 955.9998 963.0063 994.0715 994.6346 1022.2377 1037.0540 1101.1294 1116.8799 1139.1759 1177.9782 1213.5131 1264.9153 1307.0946 1383.9693 1430.5010 1442.7725 1456.4726 1480.2290 1485.7205 1529.6988 1574.3159 1611.7924 3001.2710 3099.6236 3142.4270 3146.6737 3154.9495 3171.5730 3181.8661
redmass: 5.3775 12.0474 5.0450 4.5863 7.1119 1.6746 3.1843 7.2699 10.1553 7.8979 8.4532 4.6992 3.4600 11.8987 9.7066 4.5301 4.7737 9.0182 4.8841 6.3080 8.3807 6.5998 6.6038 3.6422 1.3518 5.7586 16.3592 1.4001 1.3768 17.5962 1.6672 3.1129 4.3865 1.9665 2.2026 1.4017 1.4997 1.0764 3.4974 1.7455 2.5517 7.7664 2.2554 1.2210 2.6345 1.0511 1.0739 6.8504 6.3654 7.2718 1.0382 1.0994 1.1002 1.0869 1.0910 1.0940 1.1002
irintensity: 1.2085 1.2703 0.8541 1.8196 3.2721 1.4407 2.8534 2.4716 5.1918 11.6116 16.3795 3.3391 14.0647 41.0068 29.8832 32.0383 14.3104 7.0978 1.9834 6.9032 3.6939 0.6835 26.2922 3.4247 94.0110 22.5449 115.2918 1.0471 0.7365 88.2827 13.2925 60.1774 81.3354 54.1538 13.6572 3.1360 9.4954 1.5775 18.0278 4.6552 107.1363 6.5843 22.6390 9.9803 83.4351 39.3993 44.1112 361.2917 7.1704 71.6923 28.2698 12.9226 2.8847 3.5485 1.5713 6.2923 11.6176
temp: 298.150 k
press: 1.00000 atm
elementType: 17 16 8 8 7 7 6 6 6 6 6 6 6 6 1 1 1 1 1 1 1
symmnumber: 1
zpe: 368109.1 jmol-1
zpe.correction: 0.140205 hartree
zpe.thermalcorrener: 0.153294 hartree
zpe.thermalcorrenthalpy: 0.154238 hartree
zpe.thermalcorrgfe: 0.100478 hartree
zpe.sumelectzpe: -1425.907831 hartree
zpe.sumelectthermal: -1425.894743 hartree
zpe.sumelectthermalent: -1425.893799 hartree
zpe.sumelectthermalfe: -1425.947559 hartree
dipole: -2.0166 -8.9296 0.2567
dipole: 9.1581
quadrupole: -85.7519 -98.7699 -103.5790
quadrupole: 0.6392 5.2055 -2.8748
quadrupole: 10.2817 -2.7363 -7.5454 0.6392 5.2055 -2.8748
hfenergy: -1426.0480367 hartree
pointgroup: C01 [X(C8H7Cl1N2O2S1)]
dipole: 1.8931898 3.0654062 -0.0336334 debye
dipolederiv: -0.8198424 0.4470218 -0.2582684 0.576 -0.558047 0.2161692 -0.2400049 0.1690572 -0.1266686 1.2293395 -0.1920863 -0.0399587 0.093967 1.8257513 -0.1491244 0.0122897 -0.3349217 1.3285325 -0.4937127 0.0595813 0.0342563 -0.0203492 -0.7205046 -0.0053303 0.0414888 -0.1047201 -0.4844266 -0.4889941 -0.0129409 0.0375263 -0.0609871 -0.5563605 -0.0214646 -0.0020091 0.24615 -0.6562889 -1.3132452 -0.1355863 -0.1674821 0.0108528 -0.7196582 -0.024278 -0.2711737 -0.2715534 -0.2436972 -0.2946089 0.0687361 0.0507241 0.3845354 -1.47355 0.257957 -0.0107538 -0.1196202 -0.3306545 0.8372149 -0.277256 -0.0191891 -0.2716019 -0.0078648 -0.0943876 -0.0131424 0.0039876 0.0719007 -0.1870861 0.037999 -0.0408031 0.199747 -0.2915291 0.0093535 -0.0014863 0.0259211 -0.2405077 -0.3090198 0.0741379 -0.0044777 -0.1633434 0.0350257 0.0241423 -0.035801 -0.002656 -0.1509455 -0.0373393 0.1199651 0.0034704 -0.2490559 0.0240417 0.0079666 0.0212784 0.0152393 -0.0603603 1.4130169 0.0556233 0.4468081 -0.4537996 1.8294026 -0.3161882 0.515619 0.247059 0.19303 0.0404315 -0.0466146 -0.0181854 -0.1054129 0.513198 0.0575355 0.0262143 0.0080782 0.216862 0.1554061 0.0162892 -0.0220102 0.0338599 0.1561828 0.0011621 -0.0225223 -0.0037339 -0.1149772 0.0228514 -0.122966 -0.0310973 0.0384502 -0.1601084 0.0062408 -0.0207697 0.015542 -0.1394048 0.0747977 0.0491419 0.0052205 0.0254922 -0.0502075 -0.0038059 -0.0067408 0.0056424 0.1625458 0.1372903 -0.0281187 0.0023154 0.0350824 0.0316957 -0.0041351 0.0078878 -0.0008382 0.1479417 0.1005987 -0.0323873 0.0304437 0.0032707 -0.0810529 0.0288678 0.0169563 0.1051398 -0.0274632 0.0405895 -0.0809888 -0.1345731 0.0065936 0.0369763 -0.0040452 -0.0813717 -0.0247105 0.0193484 -0.0236028 0.052888 0.0852809 -0.0148789 0.081856 0.0134913 0.0237056 0.0309558 0.1156463 -0.0753387 0.035011 0.0267069 0.0312801 0.0727512 -0.0079644 0.0181695 -0.0123118 0.167454 -0.0087464 -0.0874496 0.0132925 -0.0997027 0.0120018 0.0078374 0.0221661 0.0022934 0.1521331 unknown
polarizability: 183.7868544|-14.0207878|164.7272084|5.9157801|-4.3815517|82.6724034 unknown
InChI: InChI=1S/C8H7ClN2O2S/c1-11-6-4-2-3-5-7(6)14(12,13)10-8(11)9/h2-5H,1H3
charge 0 multiplicity 1
21 atoms
Cl -3.395851 1.362148 -1.007522
S  -0.530777 -1.805589 0.274505
O  -0.196758 -3.166941 -0.528088
O  -0.891206 -1.852879 1.856221
N  -0.888795 1.247215 0.099832
N  -1.950256 -0.855775 -0.638702
C  0.476934 0.819107 0.02428
C  0.826362 -0.552941 -0.015471
C  1.538185 1.759553 -0.063497
C  2.142338 -1.011366 -0.180525
C  -1.890743 0.429755 -0.419015
C  -1.172858 2.61783 0.592957
C  2.868986 1.316347 -0.201591
C  3.180846 -0.061574 -0.278182
H  1.325483 2.831733 -0.053265
H  2.339018 -2.087425 -0.229139
H  -1.064267 3.373171 -0.206082
H  -0.479415 2.843567 1.418329
H  -2.199861 2.661295 0.979844
H  4.216157 -0.390559 -0.405168
H  3.669877 2.059626 -0.272223
