program: Gaussian 09
title: 000198695
version: EM64L-G09RevD.01
frameworkgroup: C1[X(C10H16N2O2)]
method: RPBEPBE
basis: SDD
operation: Freq
keyword: #p
keyword: freq=noraman
keyword: PBEPBE/SDD
title: #p freq=noraman PBEPBE/SDD
converged: YES YES NO NO
title: Mulliken charges:
elementType: O O N N C C C C C C C C C C H H H H H H H H H H H H H H H H
charge: -0.284073 -0.244741 -0.114262 -0.381232 -0.147493 -0.389076 -0.382477 -0.377674 -0.376129 -0.405250 -0.424250 0.188199 -0.518609 0.140595 0.239933 0.210030 0.271061 0.228013 0.213243 0.208312 0.215197 0.207324 0.206111 0.227397 0.193544 0.241988 0.215305 0.253510 0.239303 0.346199
chargesum: 0.00000
title: Mulliken charges with hydrogens summed into heavy atoms:
elementType: O O N N C C C C C C C C C C
charge: -0.284073 -0.244741 -0.114262 -0.035033 0.092440 0.092015 0.058779 0.045835 0.037307 0.015691 0.033043 0.188199 -0.025796 0.140595
polarizability: 1.65226115e+02 -5.50703740e+00 1.15087323e+02 4.86501453e-01 -2.52343685e+00 9.05362979e+01
1716.lowfreq: -12.1743 -2.0049 -0.0002 0.0005 0.0005 16.2604 35.5728 61.0732 69.7203
frequency: 35.3297 61.0507 69.6798 85.4102 138.3369 159.5840 184.3390 242.0964 282.7779 300.2739 361.9766 392.0244 418.4203 443.9443 449.7464 491.6894 516.5711 577.4924 601.4051 637.3734 657.9721 680.0171 784.0018 802.0286 817.8972 834.6745 847.9198 868.6356 903.4298 917.7743 948.1826 962.8234 996.9020 1017.6250 1042.2675 1050.6129 1089.4615 1111.3833 1123.6646 1134.3528 1141.9265 1155.8150 1196.1111 1227.4442 1239.7488 1249.4628 1256.8736 1271.0628 1275.7795 1291.8648 1299.4312 1329.2616 1333.6393 1339.5955 1345.1692 1349.4170 1357.4649 1379.4065 1423.9480 1454.9190 1457.4201 1463.9344 1466.6440 1469.4402 1471.4426 1478.7071 1579.6685 1670.3241 2934.7499 2955.0481 2963.4137 2971.8854 2985.7924 2990.8781 3011.1709 3018.1563 3041.0160 3048.7127 3058.1314 3083.9736 3091.2527 3099.3014 3100.7086 3560.6148
redmass: 4.2545 4.7912 3.4027 5.2702 2.9624 2.9679 2.7934 2.6044 2.9509 2.9946 4.4696 1.8250 3.4196 3.1298 3.4336 1.7487 2.1252 2.3211 2.6261 2.9406 6.2164 3.6898 4.3500 1.5153 2.2274 2.7560 1.4781 2.7878 2.5821 2.3984 1.3299 2.7287 2.2375 2.3407 2.0715 2.1183 1.4290 2.4572 2.2269 1.5779 2.1423 1.2859 1.4151 1.6739 2.1292 1.9342 1.2754 1.3925 1.2020 1.5140 1.3391 1.2974 1.4703 1.3503 1.4762 1.4687 1.3803 1.9065 3.0371 1.0835 1.0901 1.0877 1.0935 1.0936 1.0889 1.1013 7.9168 9.0763 1.0832 1.0713 1.0692 1.0643 1.0609 1.0611 1.0647 1.0625 1.0963 1.1024 1.1031 1.1016 1.0940 1.0958 1.0953 1.0781
irintensity: 0.5981 0.6921 0.1964 1.2801 1.1668 0.4940 3.6628 0.2291 9.2963 2.6995 22.9257 4.3014 2.9365 6.3757 13.8337 23.9159 7.3756 45.6996 8.9464 32.8853 24.7312 17.2333 3.8759 0.3761 4.7286 2.4967 17.8514 2.5366 5.9885 3.1811 6.1011 3.1426 19.5190 20.4228 4.4483 0.5402 1.3516 27.2577 1.2005 36.3861 5.7024 0.8585 42.9319 70.4911 60.7818 110.1656 9.3047 3.3200 18.7218 8.5673 6.7262 4.7114 15.6746 2.7259 6.1974 2.2222 12.7466 47.6545 79.6680 8.2438 9.2397 13.4793 25.8059 3.7549 9.3734 6.5862 296.5354 497.0187 56.2882 28.9354 44.2280 41.1399 27.7360 30.2841 22.3317 20.1871 52.8667 35.1624 75.1029 18.5697 6.4458 19.5263 27.1441 56.9304
temp: 298.150 k
press: 1.00000 atm
elementType: 8 8 7 7 6 6 6 6 6 6 6 6 6 6 1 1 1 1 1 1 1 1 1 1 1 1 1 1 1 1
symmnumber: 1
zpe: 669501.3 jmol-1
zpe.correction: 0.255000 hartree
zpe.thermalcorrener: 0.268088 hartree
zpe.thermalcorrenthalpy: 0.269032 hartree
zpe.thermalcorrgfe: 0.214565 hartree
zpe.sumelectzpe: -649.555804 hartree
zpe.sumelectthermal: -649.542715 hartree
zpe.sumelectthermalent: -649.541771 hartree
zpe.sumelectthermalfe: -649.596239 hartree
dipole: 7.0974 -4.7024 0.5803
dipole: 8.5337
quadrupole: -104.2348 -85.9788 -81.6119
quadrupole: 7.6132 -3.6048 -1.3106
quadrupole: -13.6263 4.6297 8.9966 7.6132 -3.6048 -1.3106
hfenergy: -649.8108033 hartree
pointgroup: C01 [X(C10H16N2O2)]
dipole: 2.8336938 1.7785524 -0.2811486 debye
polarizability: 165.4502112|4.3652745|114.6736507|-0.5285514|-3.2994901|90.7258741 unknown
InChI: InChI=1S/C10H16N2O2/c13-9-5-4-8(11-9)10(14)12-6-2-1-3-7-12/h8,11H,1-7H2
charge 0 multiplicity 1
30 atoms
O  -0.157794 -1.980751 -0.158173
O  -4.589222 -0.439445 0.461171
N  1.344109 -0.211469 -0.352764
N  -2.239121 -0.493884 0.700145
C  -1.044898 0.253242 0.291168
C  2.437678 -1.129604 -0.760238
C  1.747098 1.207475 -0.232943
C  3.638504 -1.022879 0.205106
C  2.942019 1.362268 0.740098
C  4.116524 0.443221 0.329071
C  -1.589063 1.145096 -0.881515
C  0.085581 -0.731989 -0.095736
C  -3.092232 1.310885 -0.54711
C  -3.441903 0.035069 0.249526
H  -0.694212 0.899191 1.125004
H  2.758257 -0.858655 -1.788256
H  2.018534 -2.147948 -0.78174
H  0.896398 1.817001 0.105657
H  2.04338 1.580073 -1.236829
H  4.456799 -1.669704 -0.163808
H  3.338066 -1.406263 1.199417
H  2.609848 1.103273 1.764681
H  3.260643 2.422255 0.75266
H  4.939807 0.523094 1.062957
H  4.522459 0.780941 -0.647289
H  -1.471751 0.598461 -1.834467
H  -1.052806 2.104505 -0.96565
H  -3.741658 1.385595 -1.433408
H  -3.285453 2.196617 0.087305
H  -2.15939 -1.439168 1.080658
