program: Gaussian 09
title: 000198701
version: EM64L-G09RevD.01
frameworkgroup: C1[X(C13H18N2O6)]
method: RPBEPBE
basis: SDD
operation: Freq
keyword: #p
keyword: freq=noraman
keyword: PBEPBE/SDD
title: #p freq=noraman PBEPBE/SDD
converged: YES YES NO NO
title: Mulliken charges:
elementType: O O O O O O N N C C C C C C C C C C C C C H H H H H H H H H H H H H H H H H H
charge: -0.281075 -0.452165 -0.450549 -0.470625 -0.448260 -0.255797 -0.211392 0.045241 0.257810 -0.178608 -0.165208 -0.066438 -0.340146 -0.569346 0.417721 -0.353816 -0.371613 -0.402167 -0.365506 0.449436 -0.804565 0.279848 0.249126 0.215179 0.243435 0.214054 0.278988 0.306790 0.370711 0.374322 0.370995 0.365403 0.307400 0.273745 0.236043 0.236119 0.227774 0.228206 0.238932
chargesum: 0.00000
title: Mulliken charges with hydrogens summed into heavy atoms:
elementType: O O O O O O N N C C C C C C C C C C C C C
charge: -0.281075 -0.081454 -0.076227 -0.099630 -0.082858 -0.255797 -0.211392 0.045241 0.257810 0.101240 0.083917 0.148741 0.117342 0.016431 0.417721 -0.046416 -0.097867 -0.166124 -0.129387 0.449436 -0.109654
polarizability: 2.41421002e+02 2.63873071e+01 1.96156596e+02 -8.20080662e+00 2.88600040e+00 1.08554627e+02
1716.lowfreq: -9.8724 -5.6530 -0.0007 -0.0005 0.0008 0.6400 22.9265 33.9027 44.8023
frequency: 22.6142 33.8000 44.6978 50.8621 75.5494 90.7982 112.4062 117.3405 136.7549 182.3349 204.6491 216.2781 220.5775 240.4269 260.9078 288.5582 305.0406 324.1606 345.9948 350.4537 368.3185 390.0885 394.2469 405.0934 409.2956 424.5551 444.6209 471.6778 501.2127 507.7808 519.7588 526.2519 549.4070 584.0776 599.3277 634.8015 685.7477 714.9393 736.4044 748.7356 777.5972 797.5031 819.2979 829.6414 853.1847 853.8209 879.8014 903.0360 932.2742 965.7714 983.5867 986.6708 990.8245 1000.2905 1008.0700 1038.8026 1047.1620 1048.5041 1058.8471 1068.4529 1087.5973 1105.2506 1130.7990 1139.5504 1187.0354 1202.2797 1218.5379 1227.6084 1229.8362 1241.1189 1248.5810 1268.8403 1300.9039 1319.5940 1323.5118 1329.2623 1342.3662 1346.7772 1355.6190 1369.4221 1379.6253 1383.0310 1388.6225 1395.0665 1398.3838 1419.7796 1435.3738 1441.2249 1472.4485 1473.9549 1506.5573 1583.1111 1620.2402 2953.1230 2976.1505 3006.6780 3013.5417 3014.3108 3057.4286 3063.6853 3087.3117 3111.6470 3114.0828 3126.2633 3131.2515 3145.2773 3183.4703 3497.7775 3512.8700 3534.0315 3534.8728
redmass: 5.7956 4.9673 1.0501 3.7572 6.3519 5.1044 6.3305 7.4557 5.5772 6.3005 5.4188 5.6347 4.4737 5.4044 5.6117 4.6238 4.5533 3.8114 3.1461 2.5958 2.7678 3.6992 4.9259 1.7538 2.9171 2.0808 1.3205 4.0836 1.5518 1.5926 1.7338 2.2929 4.9129 4.2293 5.3685 6.7280 5.0614 3.3696 3.6395 5.6896 4.5880 4.1859 4.5831 1.5024 1.2620 4.2655 4.0456 2.2216 3.4561 1.3156 1.4608 2.2145 1.9270 3.6567 3.4025 3.5749 1.5849 3.0267 3.2375 3.0278 2.5463 2.2889 3.4837 1.4808 1.1918 1.1542 1.1512 2.5046 1.3703 1.7704 1.2670 1.2217 1.6059 1.5254 1.3798 1.7052 3.3343 1.3144 1.2551 1.3727 3.9719 1.6660 1.6040 1.6812 1.2217 2.4310 1.1971 1.0869 1.1139 1.0543 2.5331 6.3822 6.1070 1.0831 1.0389 1.0734 1.0764 1.0632 1.0946 1.0856 1.0999 1.1005 1.0989 1.0889 1.0904 1.0974 1.0945 1.0646 1.0655 1.0654 1.0654
irintensity: 4.4949 2.2702 0.6487 1.2750 2.9110 0.2865 3.8797 1.5395 1.3457 10.1104 3.0916 2.6695 4.1735 18.4193 1.4933 3.3343 9.1131 1.2452 15.3603 6.9968 21.3323 10.4167 12.7436 54.8708 2.7376 20.3088 57.1479 16.4105 98.9472 104.9858 157.7641 143.6027 33.0661 34.3799 3.9308 0.7804 17.0216 0.8958 12.0112 37.2948 30.8947 11.6873 20.1387 47.0568 10.2296 53.5835 95.6955 15.8069 77.8361 4.3947 3.6218 20.2492 15.2346 56.4104 34.9338 119.5884 19.3970 74.6436 8.0912 64.6248 70.6107 12.8564 20.8102 8.3694 9.2121 14.2800 53.2828 8.2471 39.4782 24.6295 47.4037 32.0630 9.2503 47.1332 12.1303 30.2245 127.5627 33.6688 3.5751 70.4554 22.7833 12.4110 15.5684 17.5493 13.0887 2.8029 21.3873 10.5509 16.1263 12.9425 82.4954 0.7517 2.8243 46.0115 33.5830 12.5943 63.5502 3.5743 21.8051 10.3137 16.0653 8.2863 0.1482 19.7432 12.7468 16.9321 1.1249 26.4882 29.4462 17.7577 22.7115
temp: 298.150 k
press: 1.00000 atm
elementType: 8 8 8 8 8 8 7 7 6 6 6 6 6 6 6 6 6 6 6 6 6 1 1 1 1 1 1 1 1 1 1 1 1 1 1 1 1 1 1
symmnumber: 1
zpe: 801613.8 jmol-1
zpe.correction: 0.305319 hartree
zpe.thermalcorrener: 0.326020 hartree
zpe.thermalcorrenthalpy: 0.326964 hartree
zpe.thermalcorrgfe: 0.255379 hartree
zpe.sumelectzpe: -1065.341844 hartree
zpe.sumelectthermal: -1065.321143 hartree
zpe.sumelectthermalent: -1065.320198 hartree
zpe.sumelectthermalfe: -1065.391783 hartree
dipole: -3.1868 -2.3474 1.2913
dipole: 4.1633
quadrupole: -112.4667 -134.0602 -122.9217
quadrupole: 6.1970 2.8956 -4.7654
quadrupole: 10.6828 -10.9106 0.2278 6.1970 2.8956 -4.7654
hfenergy: -1065.6471622 hartree
pointgroup: C01 [X(C13H18N2O6)]
dipole: -1.2688638 -0.9046282 0.5045424 debye
polarizability: 242.6772316|25.3280983|192.4513833|-13.7602589|9.3827564|111.0036109 unknown
InChI: InChI=1S/C13H18N2O6/c1-8-2-4-9(5-3-8)15(14-20)7-13(19)12(18)11(17)10(16)6-21-13/h2-5,10-12,16-19H,6-7H2,1H3
charge 0 multiplicity 1
39 atoms
O  1.062732 -1.424991 -0.276525
O  1.377988 0.353792 1.331879
O  3.149863 1.709846 -0.446321
O  5.1538 -0.373002 -0.394666
O  3.713024 -2.468705 -1.402571
O  0.272776 3.158844 0.34138
N  -0.855266 1.243864 -0.098418
N  -0.828165 2.520169 0.506399
C  1.365112 -0.007409 -0.082595
C  2.796308 0.294306 -0.578897
C  3.81554 -0.581184 0.172953
C  3.490031 -2.07577 -0.010732
C  2.028765 -2.35381 0.362215
C  0.296641 0.779106 -0.898213
C  -2.104757 0.531037 -0.016968
C  -2.131846 -0.871737 -0.219129
C  -3.306972 1.22866 0.269577
C  -3.360277 -1.561385 -0.140768
C  -4.517782 0.516106 0.354787
C  -4.573119 -0.889164 0.15316
C  -5.884436 -1.644334 0.269567
H  2.850359 0.065829 -1.657239
H  3.797576 -0.317524 1.248826
H  4.141306 -2.67224 0.665114
H  1.730276 -3.348472 -0.002085
H  1.911248 -2.299082 1.46134
H  -0.063102 0.143873 -1.720555
H  0.782502 1.687644 -1.29968
H  0.447659 0.424987 1.670109
H  2.717705 2.067034 0.375673
H  5.276489 0.605943 -0.508813
H  4.575717 -2.048517 -1.667758
H  -1.203309 -1.419098 -0.415114
H  -3.285592 2.311575 0.411056
H  -3.370662 -2.645386 -0.305399
H  -5.442738 1.064862 0.568719
H  -6.740782 -1.019979 -0.040619
H  -5.884635 -2.557763 -0.350391
H  -6.070172 -1.95733 1.315701
