program: Gaussian 09
title: 000198737
version: EM64L-G09RevD.01
frameworkgroup: C1[X(C23H25N3)]
method: RPBEPBE
basis: SDD
operation: Freq
keyword: #pfreq=noraman
keyword: PBEPBE/SDD
title: #p freq=noraman PBEPBE/SDD
converged: YES YES NO NO
title: Mulliken charges:
elementType: N N N C C C C C C C C C C C C C C C C C C C C C C C H H H H H H H H H H H H H H H H H H H H H H H H H
charge: -0.149933 -0.149724 -0.335865 0.178664 0.282348 0.284215 0.244700 0.393044 0.393461 -0.425194 -0.424401 -0.415046 -0.415246 -0.370461 -0.370112 -0.365081 -0.365157 -0.350928 -0.367920 -0.346946 -0.336022 0.058030 -0.645824 -0.646223 -0.645844 -0.646275 0.267810 0.268929 0.256733 0.256328 0.238223 0.238628 0.236374 0.236243 0.256547 0.257206 0.216843 0.245175 0.235209 0.217691 0.238588 0.218065 0.236176 0.235694 0.235130 0.217578 0.239589 0.235454 0.236444 0.218134 0.198950
chargesum: 0.00000
title: Mulliken charges with hydrogens summed into heavy atoms:
elementType: N N N C C C C C C C C C C C C C C C C C C C C C C C
charge: -0.149933 -0.149724 -0.136915 0.178664 0.282348 0.284215 0.244700 0.393044 0.393461 -0.157384 -0.155472 -0.158313 -0.158918 -0.132238 -0.131484 -0.128707 -0.128913 -0.094381 -0.110714 -0.130102 -0.090848 0.058030 0.045664 0.043712 0.046453 0.043757
polarizability: 4.56430109e+02 4.28981825e+00 5.36946030e+02 -4.82985477e+00 1.20291162e+00 1.61129964e+02
1716.lowfreq: -5.4781 -3.2572 -0.0009 -0.0007 -0.0005 5.2195 30.1184 36.0215 38.5094
frequency: 30.1166 35.9789 38.5023 44.4694 47.4297 70.5918 81.0082 98.7997 103.4905 114.3921 127.5946 128.8983 134.8988 183.1676 197.0852 198.8152 205.0405 208.6535 236.2057 239.7057 271.0932 296.4107 318.0213 331.2562 358.7911 402.2276 414.2609 422.7839 427.8028 432.2417 432.7814 468.1408 474.7914 491.4490 517.8793 519.9211 559.0875 564.6000 606.7168 615.4212 622.7681 632.7241 653.0340 725.5924 732.3107 744.0827 751.3002 756.0937 767.7383 794.9553 808.0548 811.7851 821.8878 826.7041 849.5057 853.4113 895.6553 906.0741 942.1341 943.7603 955.3430 957.1116 962.5842 964.3079 968.2898 983.2489 995.7485 996.0464 999.6282 1055.7070 1055.8675 1081.6681 1107.4106 1107.5978 1110.4924 1110.5076 1134.5595 1136.5152 1158.0508 1163.1478 1166.3909 1184.1791 1190.3202 1204.8704 1218.8991 1259.7548 1259.9414 1288.8531 1307.7708 1320.5226 1326.8150 1352.0112 1358.9054 1363.4120 1364.4932 1372.1970 1375.5650 1425.9425 1427.7582 1436.3198 1443.8173 1447.5692 1455.2543 1459.1548 1462.7332 1464.0602 1464.2608 1475.6437 1475.7495 1492.7061 1493.1163 1504.3503 1504.4175 1525.2775 1525.8931 1536.9912 1540.0519 1546.0523 1547.8011 1615.3285 1620.5265 1634.7589 2941.3565 2941.7126 2948.6147 2949.3274 3007.9598 3008.3539 3010.6011 3011.2949 3096.6153 3096.6247 3104.3867 3106.6902 3106.8303 3132.3227 3133.9962 3135.2026 3136.6765 3138.7163 3143.2877 3160.6395 3162.7070 3162.9311 3167.2047 3167.6148 3272.7984
redmass: 4.3819 3.5989 4.0951 3.0247 5.5284 2.9282 2.4529 2.5765 2.4367 2.5962 1.7588 1.8024 4.4047 3.4938 1.5614 1.2987 2.3450 2.4155 3.3586 2.6447 4.3184 4.3497 4.1011 4.2855 4.9739 3.6813 3.1377 3.0636 3.2048 3.2590 3.1735 3.6001 3.6031 2.8164 3.2300 2.7797 3.5820 3.2380 4.7947 6.3155 5.3595 7.1466 3.9333 4.6878 3.9849 4.3532 3.6627 1.3515 4.0358 5.4608 1.2579 1.2653 1.7603 1.8987 1.4533 1.5627 4.9861 6.0102 3.0782 3.1433 1.3860 1.3932 2.8328 1.3493 1.3386 1.2821 2.0200 1.6597 2.5756 1.4993 1.4990 1.7016 1.2373 1.2373 1.3235 1.3238 1.5093 1.4915 1.2033 1.8692 1.6708 1.3702 1.4925 1.1262 1.3196 2.8742 2.8719 1.8109 1.7590 1.4347 1.7033 2.5992 2.3703 3.2102 3.2298 4.9527 2.7008 1.7921 1.3918 2.1654 2.3488 3.1573 1.7536 1.2351 1.8278 1.0444 1.1194 1.0461 1.0460 1.0982 1.1094 1.1854 1.1708 2.4176 2.3408 4.9424 6.1154 6.8131 6.6657 6.0611 5.8485 6.4428 1.0368 1.0368 1.0394 1.0394 1.0992 1.0994 1.1028 1.1026 1.0963 1.0964 1.0875 1.0943 1.0943 1.0868 1.0882 1.0879 1.0888 1.0877 1.0942 1.0973 1.0937 1.0938 1.0948 1.0949 1.0744
irintensity: 1.0804 1.2145 0.3990 0.5791 0.4736 0.7514 0.9510 0.7529 6.2716 0.9271 1.0252 0.4780 1.9308 0.5246 0.1739 0.3710 0.4477 0.5702 1.9848 4.4146 3.9251 0.0172 0.7872 3.5200 2.6313 6.3091 12.8113 5.0871 0.1998 6.0236 0.4313 0.8585 7.5395 20.8822 8.4854 3.0026 16.4414 22.9139 6.5903 4.6059 7.0719 0.0429 12.7849 5.1164 2.2698 8.3997 4.5119 15.6492 14.0281 0.6226 9.6913 13.7361 26.4329 79.9056 78.3797 12.5588 16.6087 2.7820 21.5578 40.9338 1.0654 1.7225 1.5995 3.7000 3.3083 0.2284 0.2347 0.3988 0.9390 26.4173 23.4404 60.0489 0.3629 0.3522 0.9668 0.9550 4.7803 2.3463 95.0322 11.6930 16.0075 17.4105 78.5937 178.1432 15.5260 27.3130 24.8185 21.9943 27.6634 0.4976 69.0503 42.6437 17.4461 267.3066 150.3586 217.5557 20.0660 71.8477 3.7066 107.1914 1.4553 48.1778 62.6937 14.9521 30.8507 1.1941 4.5471 22.3472 21.8857 3.3876 6.4256 37.6210 67.4131 282.0510 115.2859 4.1076 9.7732 25.9697 1.1799 422.4592 709.6233 51.0725 97.5088 95.2138 227.1714 126.7113 2.0360 6.2875 79.3883 75.6496 3.8265 3.8254 12.1795 66.3982 39.6842 3.3467 11.2940 1.0969 13.9302 4.8888 16.1091 13.2171 22.3385 25.2306 25.1171 11.2184 21.8639
temp: 298.150 k
press: 1.00000 atm
elementType: 7 7 7 6 6 6 6 6 6 6 6 6 6 6 6 6 6 6 6 6 6 6 6 6 6 6 1 1 1 1 1 1 1 1 1 1 1 1 1 1 1 1 1 1 1 1 1 1 1 1 1
symmnumber: 1
zpe: 1106419.1 jmol-1
zpe.correction: 0.421413 hartree
zpe.thermalcorrener: 0.446352 hartree
zpe.thermalcorrenthalpy: 0.447296 hartree
zpe.thermalcorrgfe: 0.365633 hartree
zpe.sumelectzpe: -1053.797990 hartree
zpe.sumelectthermal: -1053.773051 hartree
zpe.sumelectthermalent: -1053.772106 hartree
zpe.sumelectthermalfe: -1053.853770 hartree
dipole: 1.2862 -10.4802 0.5733
dipole: 10.5744
quadrupole: -92.5720 -176.7923 -155.7168
quadrupole: 9.7817 -1.7096 4.1674
quadrupole: 49.1217 -35.0986 -14.0231 9.7817 -1.7096 4.1674
hfenergy: -1054.2194027 hartree
pointgroup: C01 [X(C23H25N3)]
dipole: -0.5193924 4.1226736 0.2045251 debye
polarizability: 454.5817509|4.2910352|536.9479952|23.7992383|0.170865|162.9763567 unknown
InChI: InChI=1S/C23H25N3/c1-25(2)21-13-7-18(8-14-21)23(17-5-11-20(24)12-6-17)19-9-15-22(16-10-19)26(3)4/h5-16,24H,1-4H3
charge 0 multiplicity 1
51 atoms
N  -4.922443 2.406284 -0.255283
N  4.923608 2.382163 0.261977
N  0.061406 -6.314296 -0.057424
C  -0.005759 -0.617142 -0.008083
C  -1.268448 0.154092 -0.070195
C  1.259913 0.147873 0.059599
C  -0.009498 -2.038127 -0.014476
C  -3.732892 1.67699 -0.199743
C  3.730564 1.659369 0.201317
C  -2.363093 -0.25662 -0.889318
C  2.356782 -0.2796 0.867332
C  -1.441585 1.366151 0.663194
C  1.434437 1.370397 -0.655985
C  -3.557131 0.475846 -0.961897
C  3.553435 0.447244 0.945891
C  -2.633433 2.104045 0.615444
C  2.629229 2.103104 -0.602249
C  -1.186096 -2.809359 0.373919
C  1.162018 -2.818731 -0.40645
C  -1.189625 -4.188565 0.389986
C  1.15482 -4.1966 -0.428518
C  -0.01826 -4.977339 -0.022817
C  -6.037996 1.93486 -1.086517
C  -5.064821 3.644155 0.522098
C  6.042342 1.891211 1.077739
C  5.069459 3.628893 -0.500499
H  -2.251856 -1.15366 -1.508413
H  2.246676 -1.187123 1.471012
H  -0.625621 1.716891 1.3050
H  0.617385 1.733717 -1.289349
H  -4.350858 0.122814 -1.626173
H  4.349276 0.079981 1.599826
H  -2.714626 3.012516 1.218821
H  2.711515 3.019925 -1.192692
H  -2.068332 -2.263353 0.725747
H  2.04997 -2.280187 -0.754618
H  -2.077243 -4.733609 0.739521
H  2.02361 -4.767757 -0.77262
H  -5.766945 1.90011 -2.161588
H  -6.893093 2.619884 -0.975109
H  -6.372595 0.921268 -0.786833
H  -6.061769 4.076533 0.343348
H  -4.963377 3.461097 1.611275
H  -4.308407 4.401411 0.231956
H  5.778194 1.840513 2.153814
H  6.900315 2.573455 0.971682
H  6.369335 0.880912 0.759324
H  4.317579 4.385916 -0.19833
H  4.963545 3.459881 -1.59154
H  6.068974 4.054345 -0.319577
H  -0.839883 -6.749778 0.243772
