program: Gaussian 09
title: 000198699
version: EM64L-G09RevD.01
frameworkgroup: C1[X(C12H14N2O7)]
method: RPBEPBE
basis: SDD
operation: Freq
keyword: #p
keyword: freq=noraman
keyword: PBEPBE/SDD
title: #p freq=noraman PBEPBE/SDD
converged: YES YES NO NO
title: Mulliken charges:
elementType: O O O O O O O N N C C C C C C C C C C C C H H H H H H H H H H H H H H
charge: -0.232240 -0.450086 -0.444659 -0.464891 -0.264557 -0.441074 -0.244455 -0.201820 0.072702 -0.143497 -0.172659 -0.115112 -0.158348 -0.352055 0.518436 -0.359978 -0.339322 -0.345129 -0.321165 0.263779 0.113898 0.277451 0.255273 0.252986 0.253875 0.257888 0.200459 0.368278 0.362758 0.379800 0.270321 0.258468 0.277343 0.278973 0.388357
chargesum: 0.00000
title: Mulliken charges with hydrogens summed into heavy atoms:
elementType: O O O O O O O N N C C C C C C C C C C C C
charge: -0.232240 -0.081808 -0.081901 -0.085091 -0.264557 -0.052717 -0.244455 -0.201820 0.072702 0.133953 0.082614 0.137874 0.095527 0.106292 0.518436 -0.089656 -0.080854 -0.067786 -0.042191 0.263779 0.113898
polarizability: 2.78473483e+02 1.30374294e+01 1.55246851e+02 -1.52452940e+01 7.15576441e+00 1.09842679e+02
1716.lowfreq: -19.0524 -5.8841 -5.5580 0.0008 0.0008 0.0009 24.8666 36.0212 44.2517
frequency: 24.6275 35.3447 44.1691 68.8856 80.5471 95.3384 116.4505 150.5707 167.3085 187.8560 201.2648 224.2165 227.6692 244.6173 252.0308 318.6743 332.2090 356.7964 363.9341 381.9204 395.9415 408.7767 432.0840 436.8966 474.9442 499.7524 517.4647 528.6179 540.0647 550.2385 594.2282 611.8072 627.7342 636.8983 656.5463 685.4681 732.5616 755.3136 758.1589 809.3463 839.3522 851.2149 863.6235 880.1322 889.5725 918.2217 976.9533 981.5834 990.9921 995.3358 1001.7279 1007.7107 1025.2752 1029.2254 1050.9327 1061.9361 1083.5893 1127.2547 1130.0402 1151.4593 1198.0804 1203.4013 1213.0101 1224.8337 1253.8980 1267.4168 1269.6885 1294.5704 1300.4571 1310.8193 1321.1828 1326.3826 1345.9265 1352.9583 1363.3461 1377.3790 1379.8473 1387.7960 1391.6698 1422.4440 1452.8035 1498.0831 1578.4606 1617.3103 1643.9606 2964.9865 3008.9883 3033.5342 3049.9796 3063.6549 3102.6604 3156.6273 3160.6312 3183.0593 3187.3628 3352.3375 3475.2906 3533.8061 3561.8868
redmass: 7.6430 6.2067 7.0187 6.6858 5.7162 6.1531 7.8353 7.8303 6.6500 5.4578 5.9604 7.5219 9.1434 6.9841 5.2956 7.1810 3.6482 4.2793 3.9576 3.5230 1.4519 2.8974 5.1469 6.2323 4.7724 6.2707 3.2871 1.2791 4.2023 4.5570 1.2694 4.0649 5.0215 3.8433 1.2368 3.4601 5.3409 5.0493 5.0716 4.5039 1.4247 2.3089 2.6027 3.3832 2.5865 3.6906 1.9847 2.0820 1.4050 4.0956 4.3366 3.7746 2.7692 3.5665 3.7325 3.6493 4.3296 1.5182 1.9750 1.6565 1.1868 1.1078 1.2490 1.2088 1.3473 1.7033 2.0776 1.3578 1.7601 1.4004 1.7173 2.9847 1.2720 2.3963 1.3847 1.2270 1.3748 1.4534 4.3699 3.5317 1.0850 2.6631 7.9143 6.2792 8.7607 1.0683 1.0841 1.0844 1.0858 1.0874 1.0963 1.0896 1.0901 1.0956 1.0967 1.0674 1.0649 1.0642 1.0658
irintensity: 0.0342 0.2824 1.3276 3.7674 1.0432 1.1884 2.4837 1.5884 4.3829 4.3736 2.7748 7.4754 12.9386 8.5000 17.4422 4.0232 3.9967 8.5468 7.8352 1.4066 95.5328 0.9783 19.9832 7.6458 18.6986 6.4952 41.8052 78.9226 22.9640 12.2841 68.3442 14.8694 15.8333 6.4464 228.4841 86.2198 4.3280 16.6124 15.5213 45.0555 26.1654 89.2334 59.3672 46.1864 30.1379 17.6503 75.0261 29.4879 3.0779 104.4467 144.4020 20.1936 125.9305 50.7999 209.2866 86.0108 95.7710 18.8887 28.0614 116.1772 6.2668 27.8660 54.2553 61.5102 4.2326 8.3152 2.0210 20.4888 69.2371 15.8676 49.9715 56.3929 3.0237 165.6810 7.8676 37.3219 3.6483 41.2340 26.3191 22.2039 12.5129 36.7548 16.3319 84.8291 328.1208 52.2023 9.8001 2.2597 18.0043 50.4885 12.7507 5.6102 0.2396 0.9533 2.0156 312.9845 27.3653 58.2912 21.2462
temp: 298.150 k
press: 1.00000 atm
elementType: 8 8 8 8 8 8 8 7 7 6 6 6 6 6 6 6 6 6 6 6 6 1 1 1 1 1 1 1 1 1 1 1 1 1 1
symmnumber: 1
zpe: 683151.1 jmol-1
zpe.correction: 0.260199 hartree
zpe.thermalcorrener: 0.279567 hartree
zpe.thermalcorrenthalpy: 0.280511 hartree
zpe.thermalcorrgfe: 0.211669 hartree
zpe.sumelectzpe: -1100.086030 hartree
zpe.sumelectthermal: -1100.066662 hartree
zpe.sumelectthermalent: -1100.065718 hartree
zpe.sumelectthermalfe: -1100.134560 hartree
dipole: -0.2529 -4.0941 0.4015
dipole: 4.1215
quadrupole: -130.5635 -116.4269 -127.9305
quadrupole: 1.7562 2.7619 8.2747
quadrupole: -5.5899 8.5468 -2.9569 1.7562 2.7619 8.2747
hfenergy: -1100.3462285 hartree
pointgroup: C01 [X(C12H14N2O7)]
dipole: -0.1055827 -1.1736712 -1.1138818 debye
polarizability: 279.6979596|7.7254622|120.5718638|10.4593644|22.1591212|143.2931898 unknown
InChI: InChI=1S/C12H14N2O7/c15-8-5-21-11(10(17)9(8)16)14(13-20)7-3-1-6(2-4-7)12(18)19/h1-4,8-11,15-18H,5H2
charge 0 multiplicity 1
35 atoms
O  2.1201 0.307208 -1.375783
O  1.480638 -2.107981 1.365694
O  4.516321 -1.783375 1.513723
O  4.643645 0.719033 0.117029
O  2.108267 1.914709 0.996227
O  -5.618491 -0.619909 -1.600876
O  -6.081805 0.412002 0.428798
N  0.4461 0.569917 0.224745
N  0.839797 1.754305 0.862102
C  2.294147 -1.008986 0.835025
C  3.668545 -1.524224 0.346393
C  1.417362 -0.413924 -0.309346
C  4.329923 -0.51521 -0.612634
C  3.403267 -0.281916 -1.812769
C  -0.971241 0.413854 0.056846
C  -1.851205 0.898524 1.058966
C  -1.484188 -0.195373 -1.116527
C  -3.237993 0.762708 0.885147
C  -2.873973 -0.336343 -1.277815
C  -3.760234 0.140555 -0.27893
C  -5.235263 0.01335 -0.4071
H  2.483508 -0.256321 1.620873
H  3.537668 -2.504086 -0.147154
H  0.839349 -1.263594 -0.720363
H  5.304157 -0.907254 -0.951505
H  3.820084 0.467447 -2.503227
H  3.227383 -1.234265 -2.356562
H  1.981177 -2.517413 2.117253
H  4.929019 -0.908239 1.754498
H  3.798482 1.236994 0.271672
H  -1.441302 1.36366 1.958468
H  -0.808789 -0.52319 -1.912448
H  -3.936446 1.121954 1.647531
H  -3.283347 -0.79993 -2.179034
H  -6.61116 -0.672386 -1.630915
