program: Gaussian 09
title: 000198780
version: EM64L-G09RevD.01
frameworkgroup: C1[X(C19H22N3O4)]
method: RPBEPBE
basis: SDD
operation: Freq
keyword: #p
keyword: freq=noraman
keyword: PBEPBE/SDD
title: #p freq=noraman PBEPBE/SDD
converged: NO YES NO NO
title: Mulliken charges:
elementType: O O O O N N N C C C C C C C C C C C C C C C C C C C H H H H H H H H H H H H H H H H H H H H H H
charge: -0.366569 -0.165701 -0.090860 -0.043328 -0.386173 -0.025745 0.122796 -0.158216 -0.427722 -0.016992 -0.224721 0.227939 0.242096 -0.706663 -0.737664 -0.737305 0.265143 0.080601 0.177253 -0.798716 0.040402 0.124210 -0.778512 -0.084820 0.156331 -0.178909 0.239059 0.204184 0.219407 0.218750 0.256266 0.224786 0.242894 0.218478 0.224028 0.242016 0.182393 0.218944 0.232745 0.218797 0.243335 0.259276 0.227055 0.403794 0.269114 0.280228 0.255342 0.410956
chargesum: 1.00000
title: Mulliken charges with hydrogens summed into heavy atoms:
elementType: O O O O N N N C C C C C C C C C C C C C C C C C C C
charge: 0.044388 -0.165701 -0.090860 -0.043328 0.017621 -0.025745 0.122796 0.080842 -0.004131 0.201757 0.031545 0.227939 0.242096 -0.020505 -0.089227 -0.066820 0.265143 0.080601 0.177253 -0.069050 0.040402 0.124210 0.026172 -0.084820 0.156331 -0.178909
polarizability: 5.09844715e+02 -4.78312334e+01 3.78611436e+02 -2.28955102e+01 -1.66041850e+01 1.52645448e+02
1716.lowfreq: -24.2360 -17.5032 -5.2992 -0.0004 0.0002 0.0009 5.6461 11.3240 25.1465
frequency: -21.3420 -4.9568 24.4658 45.8398 56.6172 59.6769 75.5941 86.6168 98.9796 106.7319 112.2864 122.1045 130.6109 146.1305 166.1073 176.3802 199.9550 218.6717 219.4095 226.0073 234.7756 243.3470 257.6674 297.4596 311.3339 313.7974 323.0174 342.6944 344.5364 351.8779 363.8146 372.6586 380.9037 400.0170 411.2897 428.7229 438.3618 458.1849 471.5027 485.5568 504.6675 526.9703 552.6645 589.4091 605.4803 615.3580 637.7033 677.5306 684.4626 724.3520 744.3961 770.7283 788.7195 820.8722 835.5524 859.0827 878.7412 893.4953 902.5772 910.3133 926.9754 946.2099 954.7754 966.8513 987.2145 998.7885 1013.3515 1020.6850 1027.6099 1031.1824 1039.1856 1086.6532 1096.5570 1108.8622 1131.3781 1140.5272 1168.7102 1176.1973 1191.9622 1212.9586 1237.2420 1252.1191 1273.8981 1277.6068 1303.0201 1309.5113 1333.8889 1335.1319 1350.2675 1356.4932 1370.2389 1383.9395 1389.1960 1392.9867 1396.1183 1412.0646 1426.7888 1441.5411 1457.7213 1461.9275 1465.6112 1467.6405 1470.8244 1475.3140 1476.5367 1478.0921 1485.5992 1488.5367 1489.2347 1493.2988 1544.1222 1551.8489 1594.2933 1606.9080 1623.6292 2006.2052 2957.1986 2963.2532 2969.6554 2977.9270 2979.6700 2981.2194 2982.4654 3010.2519 3030.4333 3048.7085 3052.5294 3060.4242 3061.9108 3070.2114 3072.8336 3078.3687 3083.3298 3083.6528 3092.7182 3137.6902 3393.7547 3510.6573
redmass: 2.9595 4.2787 5.3378 5.2826 6.1972 4.4763 6.1563 4.9044 4.1932 1.1433 1.6464 2.0589 3.4125 3.3841 3.6694 3.7499 8.4557 1.4921 2.9811 2.9681 1.1225 1.9438 1.2607 4.9661 4.8566 6.2786 4.0536 3.4802 3.7963 2.4140 8.6161 3.8667 2.6515 2.9892 8.0783 4.6122 3.3065 1.6687 10.0078 4.9673 6.3584 3.9725 2.6570 4.9215 6.6078 4.2076 10.1004 5.8434 6.0157 5.2578 5.4963 2.9923 6.1431 2.8309 6.4433 2.3660 1.5542 1.3594 1.4609 1.2369 1.9348 2.8789 1.5557 2.1131 2.5201 2.1254 1.7131 1.6179 1.9384 1.9019 1.7100 1.6337 3.0093 3.7785 3.7517 2.9392 2.6041 2.5750 1.9421 2.3598 2.6919 2.1456 1.5332 2.1829 1.4951 1.4483 2.2471 1.9586 1.3060 1.5098 1.2189 1.2213 1.2304 1.2815 1.2097 4.3490 1.4236 1.1023 1.0837 1.0687 1.0743 1.0700 1.0473 1.0754 2.0726 1.2916 1.0669 1.3773 2.5519 2.8341 8.0023 10.1757 6.7402 10.8916 6.5254 13.9129 1.0447 1.0580 1.0382 1.0717 1.0383 1.0387 1.0431 1.0860 1.0987 1.0965 1.0908 1.0984 1.0956 1.0994 1.0991 1.0947 1.1001 1.0954 1.0991 1.0977 1.0771 1.0670
irintensity: 0.2330 0.1524 1.6895 0.4610 1.4478 0.1689 0.5883 2.1773 0.6698 2.1685 0.3051 2.4725 1.9970 2.2108 2.4424 0.3359 6.4665 1.0356 6.7140 5.2094 2.2414 0.1484 0.3324 6.2261 15.7106 16.2333 2.5154 2.5885 1.3293 2.5897 3.8590 4.7571 3.7456 2.4602 18.6510 32.8452 8.2002 93.0938 4.9140 1.7957 12.7863 6.2750 5.7066 2.5944 2.2675 28.9768 3.3565 4.5967 7.6115 7.1496 0.6018 0.3526 1.9220 6.7654 4.7231 11.2359 4.9987 82.7324 44.0363 2.4264 23.3905 53.5155 11.1379 27.2549 26.7006 36.9569 27.3335 11.5532 29.2273 51.5649 1.7913 3.9361 19.3422 92.3599 106.9190 49.0222 26.2998 56.9446 5.2633 5.7554 20.4511 17.5694 20.1830 20.9109 24.6093 5.8561 65.9432 53.8342 22.9658 14.0921 15.9125 25.9821 25.0363 66.1702 36.2049 23.1220 5.5724 144.5445 6.1585 9.0914 11.8499 11.5163 20.7408 20.2757 266.5659 53.1457 15.4450 77.6969 204.2187 193.4737 589.6374 703.9668 318.1527 72.7488 312.3583 576.7538 32.3480 30.4639 19.8685 18.0617 50.0410 9.6031 7.6698 2.6499 32.4651 32.4534 0.8079 89.8605 10.7423 47.4570 28.9005 6.4283 26.0339 33.5719 5.2723 8.3282 155.1708 77.6208
temp: 298.150 k
press: 1.00000 atm
elementType: 8 8 8 8 7 7 7 6 6 6 6 6 6 6 6 6 6 6 6 6 6 6 6 6 6 6 1 1 1 1 1 1 1 1 1 1 1 1 1 1 1 1 1 1 1 1 1 1
symmnumber: 1
zpe: 985314.2 jmol-1
zpe.correction: 0.375286 hartree
zpe.thermalcorrener: 0.400823 hartree
zpe.thermalcorrenthalpy: 0.401767 hartree
zpe.thermalcorrgfe: 0.320837 hartree
zpe.sumelectzpe: -1200.138022 hartree
zpe.sumelectthermal: -1200.112486 hartree
zpe.sumelectthermalent: -1200.111542 hartree
zpe.sumelectthermalfe: -1200.192471 hartree
dipole: -2.5202 -3.9508 1.7995
dipole: 5.0198
quadrupole: -132.2471 -131.3231 -144.3651
quadrupole: -4.8306 2.2656 1.2376
quadrupole: 3.7313 4.6553 -8.3866 -4.8306 2.2656 1.2376
hfenergy: -1200.5133087 hartree
pointgroup: C01 [X(C19H22N3O4)]
dipole: 1.0093784 1.5352439 0.7242518 debye
polarizability: 513.0426491|-43.6331891|373.8207031|-5.8462617|32.7426558|154.2382462 unknown
InChI: InChI=1S/C19H22N3O4/c1-8(2)6-9(3)7-10(4)12-11(5)19(26)21-14-13(12)16(23)15(22-20)18(25)17(14)24/h7-9,21,23H,6H2,1-5H3
charge 1 multiplicity 1
48 atoms
O  0.119621 1.619437 0.65421
O  -1.439791 -4.395865 -0.813292
O  -4.725568 -0.975279 -0.113338
O  -4.726319 1.838745 0.395644
N  -2.395606 -2.356731 -0.240547
N  -2.298841 3.100144 0.688531
N  -2.645217 4.214209 0.82661
C  3.928055 -0.205783 0.136666
C  4.531916 0.69292 -0.987295
C  3.864809 2.075182 -1.2549
C  2.523186 -0.675371 -0.151779
C  1.470646 -0.700164 0.734667
C  0.150804 -1.25075 0.297058
C  4.834066 -1.468839 0.318111
C  3.646203 2.891658 0.041637
C  2.562877 1.97819 -2.086614
C  -1.073129 -0.427708 0.331381
C  0.046136 -2.600668 -0.091769
C  -2.334219 -1.04046 0.075129
C  1.59501 -0.25145 2.18487
C  -1.260598 -3.213093 -0.425662
C  -1.083956 1.000006 0.499977
C  1.188773 -3.574935 -0.167242
C  -3.656157 -0.346812 0.094724
C  -2.303125 1.76217 0.504442
C  -3.671698 1.170209 0.345737
H  3.949987 0.35556 1.089199
H  4.555959 0.114076 -1.933917
H  5.590065 0.869556 -0.708039
H  4.595016 2.638322 -1.872921
H  2.353569 -1.052849 -1.172747
H  4.854021 -2.082405 -0.601504
H  5.870711 -1.154841 0.535884
H  4.486933 -2.104506 1.152339
H  3.328878 3.924172 -0.195498
H  4.572966 2.959127 0.640794
H  2.866264 2.429965 0.680376
H  1.770337 1.438848 -1.534866
H  2.736483 1.446122 -3.039905
H  2.184433 2.988226 -2.335222
H  2.056935 0.747024 2.274803
H  2.235369 -0.958912 2.746244
H  0.620193 -0.223704 2.699876
H  -3.326812 -2.77169 -0.419523
H  1.464621 -3.764314 -1.223824
H  0.869011 -4.557174 0.225406
H  2.082108 -3.223865 0.366373
H  0.10787 2.613399 0.629214
