program: Gaussian 09
title: 000198657
version: EM64L-G09RevD.01
frameworkgroup: C1[X(C7H6N2S)]
method: RPBEPBE
basis: SDD
operation: Freq
keyword: #pfreq=noraman
keyword: PBEPBE/SDD
title: #p freq=noraman PBEPBE/SDD
converged: YES YES NO NO
title: Mulliken charges:
elementType: S N N C C C C C C C H H H H H H
charge: 0.319771 -0.704136 -0.306109 0.506061 -0.617717 0.591523 -0.445752 -0.411432 -0.187361 -0.332773 0.243350 0.220326 0.224291 0.267576 0.313471 0.318913
chargesum: 0.00000
title: Mulliken charges with hydrogens summed into heavy atoms:
elementType: S N N C C C C C C C
charge: 0.319771 -0.071752 -0.306109 0.506061 -0.617717 0.591523 -0.202403 -0.191106 0.036930 -0.065197
polarizability: 1.37164349e+02 1.52065181e+00 1.29262385e+02 1.56721062e-02 -8.61508776e-05 4.12693134e+01
1716.lowfreq: -0.0027 -0.0012 -0.0008 7.6537 10.2798 11.4557 134.0394 185.5132 234.0463
frequency: 134.0360 185.5125 234.0462 256.8503 331.6717 392.4762 427.9126 455.0824 459.1025 497.8971 532.0053 552.4740 601.7212 612.7436 707.6204 713.5600 781.6603 807.3086 858.3866 892.3308 964.4026 984.1105 1035.8632 1080.7878 1107.0452 1185.5893 1208.9211 1273.1663 1332.7384 1401.0673 1414.3077 1440.9679 1498.2107 1590.5435 1603.3590 1648.0376 3125.1707 3145.3387 3148.2491 3167.6324 3564.4968 3703.8317
redmass: 4.8350 5.3969 5.0996 3.8702 1.1034 1.2004 5.9886 4.4077 5.6242 7.4398 3.6501 8.7920 6.7923 3.6386 8.6251 2.0626 1.6988 5.7828 1.4368 1.5581 1.3403 2.0700 5.8514 2.1271 1.6110 1.2373 1.2644 2.1065 2.6411 4.7154 9.0504 3.0090 4.1008 6.6567 5.5092 1.2144 1.0873 1.0908 1.0929 1.0988 1.0455 1.1040
irintensity: 4.5718 0.8456 2.6997 5.8221 98.8738 205.1137 0.7665 0.1946 13.4275 1.2071 2.0143 13.6421 3.6072 8.2680 2.1219 25.3279 46.9466 14.5456 22.0444 25.6371 2.2963 0.3651 25.1508 1.3956 4.8265 1.7704 21.5767 1.6048 36.3038 23.5343 17.3039 17.4590 52.2756 13.2094 82.1251 231.6844 12.5573 11.4762 6.5759 17.8272 66.4139 23.9349
temp: 298.150 k
press: 1.00000 atm
elementType: 16 7 7 6 6 6 6 6 6 6 1 1 1 1 1 1
symmnumber: 1
zpe: 305396.1 jmol-1
zpe.correction: 0.116319 hartree
zpe.thermalcorrener: 0.124570 hartree
zpe.thermalcorrenthalpy: 0.125514 hartree
zpe.thermalcorrgfe: 0.083425 hartree
zpe.sumelectzpe: -777.200873 hartree
zpe.sumelectthermal: -777.192622 hartree
zpe.sumelectthermalent: -777.191678 hartree
zpe.sumelectthermalfe: -777.233767 hartree
dipole: -3.8394 1.0920 0.0041
dipole: 3.9916
quadrupole: -66.6221 -50.0882 -70.5621
quadrupole: -4.6249 0.0115 0.0151
quadrupole: -4.1980 12.3359 -8.1379 -4.6249 0.0115 0.0151
hfenergy: -777.3171922 hartree
pointgroup: C01 [X(C7H6N2S1)]
dipole: 1.5648992 0.1248552 0.0419458 debye
dipolederiv: -0.2188902 -0.2275433 -0.0072382 0.0179169 -0.3264135 0.0056326 -0.0101449 -0.001585 0.1197926 -0.2782035 -0.4055303 0.0213917 -0.5168061 -1.2671051 -0.0102592 0.0219065 -0.0076562 -0.7260974 -0.3404224 0.3639129 -0.0048295 0.2593523 0.298857 0.000674 -0.00391 0.0039921 -0.3051556 -0.2165899 -0.1291453 -0.0082027 -0.123956 0.0624398 -0.0028497 -0.008382 -0.0029625 0.1173782 0.2082051 -0.6956468 0.0199392 -0.2375233 -0.1416621 -0.0074475 0.0146639 -0.0223014 -0.2044978 0.0611203 0.5992551 -0.01217 0.7379345 1.2775804 0.0092226 -0.0136355 0.0050768 0.1997663 -0.1367606 0.1165452 0.0013885 -0.0150249 -0.1147055 -0.0018434 0.0031121 0.0018443 -0.2308498 0.0577049 0.2257175 0.0054243 -0.3139466 -0.2543232 -0.0090066 0.0124034 0.0078354 -0.2403486 0.1727677 -0.1035738 0.0099184 0.1191565 0.1357555 0.0002308 0.0072686 -0.0059473 -0.1299825 0.4141921 0.1693355 0.0116355 0.0460019 -0.0550274 0.0012597 0.0130628 0.0050942 -0.055325 0.0525148 -0.0699007 -0.0029279 -0.0279742 -0.0651261 0.0021229 -0.0035563 0.0010058 0.1840551 -0.1257496 -0.0492955 -0.0075739 -0.0653095 0.05891 -0.0005246 -0.0072796 -0.0001257 0.1700226 -0.0145339 0.1179531 -0.0062714 0.1141982 -0.0268862 0.0054389 -0.0064222 0.0053894 0.1568797 0.079912 -0.0066741 -0.0027362 -0.0877905 -0.0224368 -0.000281 -0.0018437 0.0019626 0.1762321 0.1496195 0.0515752 -0.0086043 0.0505777 0.1965025 0.0043504 -0.008665 0.0033246 0.3855025 0.1351137 0.0430153 -0.0091436 0.0431932 0.2436407 0.00328 -0.0085781 0.0050528 0.3826277 unknown
polarizability: 136.1935665|-2.8925968|130.1397432|2.7797929|-1.1178459|41.3627376 unknown
InChI: InChI=1S/C7H6N2S/c8-6-3-1-2-5-4-9-10-7(5)6/h1-4H,8H2
charge 0 multiplicity 1
16 atoms
S  -1.510848 1.650859 -0.07647
N  1.725147 2.159568 0.010205
N  -2.707773 0.255158 -0.095832
C  -0.557585 -0.837088 -0.020628
C  -0.099796 0.513807 -0.022687
C  1.284895 0.837504 0.012935
C  0.370837 -1.912843 0.018812
C  2.195081 -0.254958 0.05134
C  1.741386 -1.598709 0.054473
C  -2.009191 -0.885712 -0.061973
H  0.023261 -2.950237 0.021088
H  3.271771 -0.047818 0.078615
H  2.483246 -2.404211 0.085132
H  -2.592255 -1.813378 -0.068504
H  2.718084 2.370895 0.041254
H  1.071642 2.936761 -0.024559
