program: Gaussian 09
title: 000198654
version: EM64L-G09RevD.01
frameworkgroup: C1[X(C12H13F3N2)]
method: RPBEPBE
basis: SDD
operation: Freq
keyword: #p
keyword: freq=noraman
keyword: PBEPBE/SDD
title: #p freq=noraman PBEPBE/SDD
converged: NO NO NO NO
title: Mulliken charges:
elementType: F F F N N C C C C C C C C C C C C H H H H H H H H H H H H H
charge: -0.119788 -0.163111 -0.163204 -0.430964 -0.012797 0.152710 0.176156 -0.249933 0.192184 0.208270 0.238013 0.105436 -0.823798 -0.849796 -0.815278 -0.851133 0.229964 0.337217 0.233213 0.233173 0.232998 0.283990 0.230007 0.229766 0.230669 0.221547 0.230721 0.258841 0.227566 0.227362
chargesum: 0.00000
title: Mulliken charges with hydrogens summed into heavy atoms:
elementType: F F F N N C C C C C C C C C C C C
charge: -0.119788 -0.163111 -0.163204 -0.093747 -0.012797 0.152710 0.176156 -0.249933 0.192184 0.208270 0.238013 0.105436 -0.124414 -0.106034 -0.132341 -0.137363 0.229964
polarizability: 2.11410875e+02 -3.24185733e+00 1.60125430e+02 -1.85683907e-02 -1.15448535e-02 8.20671674e+01
1716.lowfreq: -56.9537 -24.2740 -15.8316 -5.6980 -0.0010 -0.0009 0.0005 4.4456 16.4826
frequency: -55.7858 -23.9692 -4.0566 61.3293 106.2810 111.0320 119.7384 163.9751 167.0957 197.4745 204.6066 239.2596 247.3095 305.8632 317.0459 338.4784 378.0922 380.5204 387.7296 402.5727 450.0395 470.5805 492.9918 513.5411 549.5383 578.0129 605.0013 624.2016 653.1854 654.1030 657.3006 697.7895 795.6921 831.2574 885.2581 921.4954 952.7060 982.4446 1010.3233 1016.9899 1030.1191 1044.2771 1045.6850 1054.3200 1071.3447 1086.7585 1101.1546 1119.2447 1128.0308 1262.4507 1280.8110 1329.0663 1351.7907 1387.0024 1391.7622 1395.1861 1397.4910 1403.8579 1415.9169 1450.8803 1460.9659 1466.0764 1476.1679 1476.9002 1482.2429 1489.8468 1495.8683 1505.0171 1528.7251 1606.1200 1626.0651 2965.6728 2973.2333 2978.3950 2979.1436 3030.4811 3038.5450 3044.6305 3053.3617 3101.8247 3107.6582 3109.4168 3118.0540 3593.7649
redmass: 1.0492 8.5115 1.0575 4.9737 6.9505 3.2769 2.5601 1.2885 1.4678 2.0947 2.3975 5.1858 5.4703 5.6222 3.5996 2.7834 3.7220 5.2254 4.1443 5.2456 5.5301 5.6911 11.4341 8.1186 5.7697 1.8828 1.7949 4.0941 4.0284 3.5040 11.8875 9.9214 5.8254 2.5060 2.8964 7.9777 12.0657 1.4233 1.3703 3.9649 1.4573 1.5439 2.4686 1.7144 2.2575 1.8385 4.9561 3.6854 5.3735 2.4465 6.8271 6.1022 5.7598 5.2372 1.4273 1.2631 1.9730 1.3391 1.3850 1.2708 1.0469 1.0951 1.0459 1.1909 1.0451 1.4088 1.0466 3.0137 2.9404 8.1589 7.2252 1.0418 1.0405 1.0400 1.0394 1.0977 1.0965 1.0966 1.0975 1.0978 1.0954 1.0948 1.0905 1.0815
irintensity: 0.0000 0.4326 0.9894 0.0066 0.5066 0.6747 1.1694 1.4645 4.2317 1.4294 7.3194 9.4959 1.1481 0.4081 0.3843 0.4389 0.4565 0.5415 1.8627 0.2278 5.2756 3.1956 0.6933 0.3235 6.7416 30.6868 47.1784 2.3334 0.0871 2.0081 2.1862 1.9139 0.2076 27.6381 2.0002 78.9416 267.8895 16.9215 8.7239 149.3015 0.2068 0.6552 47.4458 0.0155 43.3880 2.9232 151.6834 3.8293 15.9565 300.0814 55.5467 31.2573 32.4469 46.4491 3.1268 14.3298 2.5174 15.8921 10.1324 13.6313 1.4553 2.3177 11.3447 12.4023 40.1333 14.9234 1.5492 54.9974 84.7825 27.1684 9.0747 39.7856 40.1141 29.6087 31.9870 19.2079 33.3169 8.7466 18.1500 8.3776 22.7094 4.2699 33.2213 67.1919
temp: 298.150 k
press: 1.00000 atm
elementType: 9 9 9 7 7 6 6 6 6 6 6 6 6 6 6 6 6 1 1 1 1 1 1 1 1 1 1 1 1 1
symmnumber: 1
zpe: 597691.3 jmol-1
zpe.correction: 0.227649 hartree
zpe.thermalcorrener: 0.242183 hartree
zpe.thermalcorrenthalpy: 0.243127 hartree
zpe.thermalcorrgfe: 0.186830 hartree
zpe.sumelectzpe: -872.882666 hartree
zpe.sumelectthermal: -872.868132 hartree
zpe.sumelectthermalent: -872.867187 hartree
zpe.sumelectthermalfe: -872.923485 hartree
dipole: -4.9694 -3.1258 -0.0026
dipole: 5.8707
quadrupole: -102.5834 -90.7497 -101.8985
quadrupole: -4.5101 -0.0076 0.0012
quadrupole: -4.1728 7.6608 -3.4880 -4.5101 -0.0076 0.0012
hfenergy: -873.1103144 hartree
pointgroup: C01 [X(C12H13F3N2)]
dipole: -1.9679295 1.2090676 0.0151968 debye
polarizability: 211.3073355|3.7652508|160.1866813|-1.9583104|-1.0492652|82.1094562 unknown
InChI: InChI=1S/C12H13F3N2/c1-5-6(2)8(4)10-9(7(5)3)16-11(17-10)12(13,14)15/h16H,1-4H3
charge 0 multiplicity 1
30 atoms
F  3.956103 -1.262708 -0.054604
F  3.831656 0.692899 -1.21637
F  3.866761 0.73065 1.045117
N  1.103034 1.108913 -0.045076
N  1.117437 -1.17954 -0.016367
C  -0.243661 0.718355 -0.020074
C  -1.43461 1.481974 -0.012489
C  -0.214811 -0.710688 -0.002463
C  -1.419133 -1.46267 0.02423
C  -2.638784 0.729307 0.014205
C  -2.62722 -0.722839 0.032212
C  1.862289 -0.066252 -0.041615
C  -1.319563 2.99691 -0.033384
C  -1.341299 -2.977335 0.042094
C  -3.996073 1.41506 0.025493
C  -3.958648 -1.458157 0.060882
C  3.348382 -0.007888 -0.065883
H  1.466663 2.060645 -0.062302
H  -0.755212 3.364701 0.846615
H  -0.78026 3.341846 -0.937999
H  -2.292861 3.507933 -0.026243
H  -0.286764 -3.294528 0.027248
H  -1.815706 -3.401169 0.946961
H  -1.847973 -3.424279 -0.833631
H  -4.579086 1.133622 0.923226
H  -3.923839 2.512177 0.012135
H  -4.603934 1.113693 -0.848973
H  -3.821947 -2.549747 0.069519
H  -4.553942 -1.190291 0.955259
H  -4.582695 -1.207693 -0.818724
