program: Gaussian 09
title: 000198648
version: EM64L-G09RevD.01
frameworkgroup: C1[X(C9H4Cl3F3N2)]
method: RPBEPBE
basis: SDD
operation: Freq
keyword: #p
keyword: freq=noraman
keyword: PBEPBE/SDD
title: #p freq=noraman PBEPBE/SDD
converged: NO NO NO NO
title: Mulliken charges:
elementType: Cl Cl Cl F F F N N C C C C C C C C C H H H H
charge: 0.023274 0.019199 0.050045 -0.114879 -0.153642 -0.153849 -0.408818 -0.004706 -0.197168 0.498659 0.521156 0.117744 -0.306999 -0.330620 -0.126258 -0.808291 0.253033 0.348617 0.273400 0.250047 0.250058
chargesum: 0.00000
title: Mulliken charges with hydrogens summed into heavy atoms:
elementType: Cl Cl Cl F F F N N C C C C C C C C C
charge: 0.023274 0.019199 0.050045 -0.114879 -0.153642 -0.153849 -0.060202 -0.004706 -0.197168 0.498659 0.521156 0.117744 -0.306999 -0.330620 -0.126258 -0.034787 0.253033
polarizability: 2.11201484e+02 -3.40112806e+00 1.65847258e+02 1.12918193e-03 1.61791666e-03 6.33911055e+01
1716.lowfreq: -20.9756 -5.2628 -1.9815 0.0024 0.0033 0.0035 8.4422 52.4292 78.7165
frequency: -20.8337 52.4231 78.7150 94.5356 100.5128 132.7086 164.9488 176.8498 197.5626 202.7687 225.8438 240.5622 269.1570 289.6432 330.8467 364.5822 366.5111 388.7340 389.8342 446.5859 490.8897 505.3360 583.4552 586.8435 641.7563 647.0324 655.5798 658.9580 704.5392 744.1468 791.7183 810.2537 920.6962 939.2139 971.7328 1021.9512 1041.2427 1042.0521 1090.8121 1097.1490 1215.3143 1244.2197 1294.6018 1320.8972 1377.7589 1387.7046 1399.4598 1449.7838 1466.4046 1469.0745 1514.1216 1581.5141 1630.0459 2992.1546 3069.8362 3118.1979 3577.1570
redmass: 16.8991 13.7564 20.7981 14.7382 5.3782 1.0429 12.5210 22.9827 4.1847 26.8343 15.6924 6.0826 5.3154 14.1984 26.4462 10.9083 7.5800 10.7373 8.6529 13.0821 13.2354 11.1600 5.1434 7.2439 1.3208 14.8738 7.1395 6.6751 10.9448 6.8901 8.3029 8.1375 10.8975 9.5649 12.1598 2.2379 1.5213 4.9929 5.6423 4.2758 7.7909 3.4013 3.5123 10.9076 5.7895 6.8572 1.2458 2.9568 1.4509 1.0459 6.3929 9.1168 9.0809 1.0376 1.0971 1.0997 1.0822
irintensity: 0.2444 0.5841 0.0607 0.9638 0.0939 1.4516 0.4433 0.2666 11.8367 0.8081 4.5484 2.2106 1.9138 0.0167 0.6627 2.6873 1.3178 0.0108 1.5457 27.4488 0.8694 4.6023 2.2610 4.1847 79.0981 2.6425 20.2828 6.3367 2.0533 30.4200 1.8078 13.9102 70.5832 21.2625 271.3486 1.2359 3.7791 239.8576 51.2328 132.6187 75.3082 291.6595 78.1997 30.3088 50.8070 23.2951 29.6423 31.9241 14.7893 17.2962 50.0974 55.2646 10.3609 6.9530 8.6617 2.8124 102.1757
temp: 298.150 k
press: 1.00000 atm
elementType: 17 17 17 9 9 9 7 7 6 6 6 6 6 6 6 6 6 1 1 1 1
symmnumber: 1
zpe: 308438.7 jmol-1
zpe.correction: 0.117478 hartree
zpe.thermalcorrener: 0.132375 hartree
zpe.thermalcorrenthalpy: 0.133319 hartree
zpe.thermalcorrgfe: 0.074556 hartree
zpe.sumelectzpe: -2133.355971 hartree
zpe.sumelectthermal: -2133.341075 hartree
zpe.sumelectthermalent: -2133.340130 hartree
zpe.sumelectthermalfe: -2133.398894 hartree
dipole: 0.6792 0.9714 -0.0041
dipole: 1.1853
quadrupole: -133.3262 -111.4364 -117.8717
quadrupole: -7.6374 0.0151 -0.0008
quadrupole: -12.4481 9.4417 3.0064 -7.6374 0.0151 -0.0008
hfenergy: -2133.4734493 hartree
pointgroup: C01 [X(C9H4Cl3F3N2)]
dipole: -0.2588859 0.3878757 0.0016702 debye
dipolederiv: -0.0816581 -0.0693969 -0.0000678 0.0328135 -0.7101994 -0.0002276 -0.0000301 -0.000264 0.0045431 -0.5551685 -0.2671726 -0.0003287 -0.3110118 -0.2143764 -0.0002023 -0.0003649 -0.0001952 -0.0179923 -0.5564568 0.2580178 -0.0001719 0.3334876 -0.1582713 0.0000937 -0.000177 0.0000783 0.0087784 -0.589054 0.2312219 -0.0023964 0.2449064 -0.6314043 0.0045928 -0.000804 0.0042815 -0.257508 -0.7597887 -0.0913136 0.1664274 -0.2579561 -0.3891129 0.218822 0.2591582 0.1815045 -0.6323518 -0.7550511 -0.0940501 -0.1640746 -0.2622853 -0.396972 -0.2233888 -0.2505142 -0.1855011 -0.6245559 -0.4485412 0.0245611 -0.0000323 -0.2701163 -0.5214071 -0.0001445 0.0005888 0.0006087 -0.2200673 -0.1526026 -0.1712987 0.0000282 0.0823246 -0.4163538 0.0002116 0.0001885 -0.0006059 -0.2102449 0.1021684 0.0734461 0.0001371 0.0326843 -0.0275182 -0.0000506 0.0004047 -0.000077 -0.0201468 0.329664 0.1295104 0.00008 0.1655382 -0.3000527 -0.0000748 0.0003216 0.000044 0.1368175 -0.0209971 -0.1595319 -0.0001294 0.0331508 0.3875249 0.0001077 -0.0001294 0.0000955 0.0631121 -0.6410591 -0.0852003 -0.0002209 -0.0491925 0.6324298 -0.0000024 -0.0044286 0.000095 -0.0540261 -0.1015898 -0.018841 -0.000026 0.0258947 0.9621243 0.0003696 -0.0000709 0.0002609 -0.0988055 0.6149686 0.6741973 0.0005832 0.6370368 0.0333785 0.0003318 0.0005649 0.0003612 -0.1192487 0.6181986 -0.4335151 0.0001502 -0.6082577 0.1804552 -0.0002102 0.000138 -0.0001463 -0.0024957 0.0082253 -0.0943457 -0.0000537 -0.0604869 -0.2182767 -0.0001087 -0.000006 -0.0001839 0.0420391 2.6082226 -0.0207066 0.0001659 0.1668391 1.3851049 -0.0001098 -0.0047026 -0.0001153 1.5637948 0.2617356 0.0503399 -0.0001089 0.0563214 0.2474155 -0.0000277 -0.0001533 -0.000324 0.3479711 -0.0258654 0.1000348 -0.0000762 0.0255016 0.1026783 0.0000093 -0.0000854 0.0000731 0.1172967 0.0722177 -0.0180498 0.092285 -0.008634 0.0263983 0.0256763 0.0650068 0.0677633 -0.01332 0.0724319 -0.0179071 -0.0921701 -0.0085584 0.0264351 -0.0256676 -0.064905 -0.0677534 -0.0135898 unknown
polarizability: 211.3274202|2.4164371|165.721293|0.0527863|0.0329972|63.3911344 unknown
InChI: InChI=1S/C9H4Cl3F3N2/c1-2-3(10)4(11)5(12)7-6(2)16-8(17-7)9(13,14)15/h17H,1H3
charge 0 multiplicity 1
21 atoms
Cl -1.342261 3.249492 0.000801
Cl -4.146747 -1.623722 -0.002122
Cl -4.16619 1.59396 -0.001088
F  3.978652 -1.279634 0.01406
F  3.87929 0.683596 -1.137898
F  3.877967 0.706651 1.126597
N  1.138778 1.106739 0.001271
N  1.150574 -1.183756 0.000639
C  -0.180591 -0.719375 0.000061
C  -0.197539 0.715025 0.000463
C  -1.381887 -1.477154 -0.000713
C  1.894021 -0.070977 0.001645
C  -1.397054 1.443842 0.000186
C  -2.575174 -0.722653 -0.001058
C  -2.598144 0.710302 -0.000605
C  -1.344709 -2.986281 -0.00113
C  3.388077 -0.017338 0.001249
H  1.48883 2.065571 0.002484
H  -0.300882 -3.335036 -0.000536
H  -1.862358 -3.395888 0.885145
H  -1.861154 -3.395362 -0.888352
