program: Gaussian 09
title: 000198653
version: EM64L-G09RevD.01
frameworkgroup: C1[X(C8H3Cl3F3N3O2S)]
method: RPBEPBE
basis: SDD
operation: Freq
keyword: #p
keyword: freq=noraman
keyword: PBEPBE/SDD
title: #p freq=noraman PBEPBE/SDD
converged: YES YES NO NO
title: Mulliken charges:
elementType: Cl Cl Cl S F F F O O N N N C C C C C C C C H H H
charge: 0.096563 0.047975 0.075953 0.941046 -0.125091 -0.158202 -0.127041 -0.498966 -0.499561 -0.424288 -0.062483 -0.725866 0.221876 0.538236 -0.060386 0.132537 -0.306665 -0.310208 -0.111438 0.271729 0.364936 0.373490 0.345854
chargesum: 0.00000
title: Mulliken charges with hydrogens summed into heavy atoms:
elementType: Cl Cl Cl S F F F O O N N N C C C C C C C C
charge: 0.096563 0.047975 0.075953 0.941046 -0.125091 -0.158202 -0.127041 -0.498966 -0.499561 -0.059352 -0.062483 -0.006522 0.221876 0.538236 -0.060386 0.132537 -0.306665 -0.310208 -0.111438 0.271729
polarizability: 2.33375424e+02 -2.37919060e+00 2.14193750e+02 -8.59511735e-02 2.72988478e+00 8.99977566e+01
1716.lowfreq: -4.3472 0.0026 0.0031 0.0037 4.0521 5.0034 11.9220 33.4803 42.8063
frequency: 11.8215 33.4425 42.8056 60.5913 76.5151 84.9844 135.1022 142.3887 170.0397 177.3767 188.4340 190.9722 214.0429 225.9467 236.9884 256.9964 271.1581 289.5299 314.5179 332.0379 370.2260 376.0567 386.0452 392.3773 415.2862 444.7877 457.9039 478.2264 491.3209 530.6990 611.6246 628.9673 651.7810 671.4017 686.4110 708.8564 732.7169 773.0014 784.2965 832.0398 847.8509 916.6182 942.7211 945.4521 952.2791 1014.0083 1028.0359 1084.7135 1115.4895 1201.9525 1205.1984 1277.3905 1311.8120 1381.5584 1401.8814 1425.8561 1498.0315 1519.0494 1555.8545 1629.6663 3303.6757 3534.5672 3576.3997
redmass: 18.6279 14.2518 12.2224 15.9865 22.8996 14.6298 14.1179 11.8078 10.9486 14.7333 14.8793 8.2868 14.6054 3.6289 11.9984 18.2522 2.7457 11.6580 9.2424 26.2330 12.4408 8.6769 3.9064 5.4901 9.6645 8.9649 4.1560 5.0736 10.4674 12.3663 9.2384 8.4921 16.9012 3.3331 1.5951 10.4226 10.1172 11.7359 2.0798 6.1221 11.5730 10.1801 9.0351 8.7595 9.8816 12.5441 12.5190 4.8903 1.2984 9.3673 4.6634 2.5017 9.2223 8.1844 11.2277 8.5007 1.7819 1.9312 11.9917 10.3694 1.0475 1.0975 1.0823
irintensity: 0.0101 2.4655 1.2950 0.5491 0.0875 1.9647 1.0102 2.2591 1.9962 2.3106 1.9343 5.6037 3.5029 27.8549 4.0308 2.6914 11.4191 0.2398 10.1276 1.8840 10.0579 2.3123 49.9314 102.2997 12.4436 55.8580 38.4876 52.2106 7.5379 3.2400 0.3074 14.6423 4.1130 23.5246 84.6273 0.3516 8.2920 24.0477 169.2818 32.5069 2.3247 44.0580 70.0936 49.7530 23.1463 210.7815 209.0823 209.0998 45.5650 43.1528 332.6832 138.2656 6.3033 71.3922 26.1373 1.9971 98.1449 3.9120 89.2162 1.8175 86.3060 88.9932 134.3507
temp: 298.150 k
press: 1.00000 atm
elementType: 17 17 17 16 9 9 9 8 8 7 7 7 6 6 6 6 6 6 6 6 1 1 1
symmnumber: 1
zpe: 296373.5 jmol-1
zpe.correction: 0.112883 hartree
zpe.thermalcorrener: 0.132508 hartree
zpe.thermalcorrenthalpy: 0.133452 hartree
zpe.thermalcorrgfe: 0.062061 hartree
zpe.sumelectzpe: -2697.468768 hartree
zpe.sumelectthermal: -2697.449143 hartree
zpe.sumelectthermalent: -2697.448199 hartree
zpe.sumelectthermalfe: -2697.519591 hartree
dipole: 3.0486 5.2974 -1.4949
dipole: 6.2922
quadrupole: -151.7905 -141.3108 -148.6142
quadrupole: -5.4790 -1.8169 6.9713
quadrupole: -4.5520 5.9277 -1.3757 -5.4790 -1.8169 6.9713
hfenergy: -2697.5816512 hartree
pointgroup: C01 [X(C8H3Cl3F3N3O2S1)]
dipole: 1.4824184 1.8834263 -0.6192302 debye
dipolederiv: -0.5681216 0.0113426 0.0609332 -0.1144168 0.0235434 0.017908 0.0693644 0.0118793 0.0304237 -0.123253 -0.2529731 -0.0006514 -0.1471231 -0.6643333 -0.0223753 0.0024123 -0.0124665 0.0185757 -0.3343186 0.3470472 0.0433907 0.3861371 -0.3853433 -0.0466994 0.049947 -0.0499744 0.0201964 1.2947155 0.1562699 -0.1269357 0.1649168 2.1182619 0.1184345 -0.0448171 0.0611482 1.4622382 -0.586954 0.1384788 0.1213956 0.2657777 -0.4507637 -0.2500869 0.158169 -0.2331792 -0.5891162 -0.6785251 -0.1820675 0.0553741 -0.2130399 -0.6037549 0.0554403 0.0351216 0.0472946 -0.2890674 -0.7084933 0.1738938 -0.1377517 0.2901391 -0.3954334 0.1755197 -0.2353323 0.1965124 -0.5930163 -0.4541341 -0.0072103 -0.0690265 -0.0744393 -0.7196056 0.0116966 0.0396689 0.0954148 -0.6973799 -0.5333216 -0.1380518 -0.0114397 -0.1371389 -0.6326056 -0.020867 -0.1232236 -0.0541875 -0.4841952 -0.4225929 -0.0536986 0.0148605 -0.379694 -0.5356486 0.0073439 -0.0094082 -0.0176882 -0.2166805 -0.336135 -0.2909603 0.0009791 -0.0324541 -0.3865739 -0.0225203 -0.0291811 -0.0229926 -0.1629573 -0.6101077 0.0575049 0.1446063 0.0554538 -0.68706 -0.0522879 0.0565008 -0.1398957 -0.7403844 0.1762277 0.2374882 0.0019163 -0.1236213 -0.2344113 -0.0040217 -0.0324819 -0.0366687 0.0308829 0.2306625 -0.0771945 -0.0050737 0.0738448 -0.3206762 -0.0244878 -0.0004683 -0.0119977 0.1367459 -0.178326 -0.0898223 -0.0063846 0.0164683 -0.2626342 0.0137698 -0.0189879 0.0502641 -0.139658 -0.4853651 0.2881672 0.0520717 0.2373566 0.6049302 0.017386 0.0921946 0.0050449 -0.0488366 0.8325149 -0.0801273 -0.1149694 0.5507648 -0.1815076 -0.0419616 -0.0554089 -0.0141105 -0.0407067 0.1369404 0.3252347 -0.0000622 0.2986947 0.9838267 0.0321267 0.0018036 0.0179468 -0.0750923 0.1922755 -0.5222653 -0.0363842 -0.853102 0.4704129 0.090465 -0.0562952 0.0672868 0.009665 2.4461939 -0.2358682 -0.0755408 -0.4030113 1.4462129 0.0170123 -0.0216182 -0.0049992 1.5423096 0.3272664 0.0425487 0.0045043 0.0577949 0.2579541 -0.0101589 0.0077989 -0.0042226 0.3466781 0.2387726 0.139298 -0.0093643 0.1399596 0.4170694 -0.0461887 0.0645461 0.0027269 0.1595744 0.1440786 0.0129652 0.0935525 -0.0592674 0.1381402 -0.0154471 0.0496956 0.046864 0.319801 unknown
polarizability: 231.1232105|-4.6408255|214.9177727|-11.5339303|9.3585135|91.5259474 unknown
InChI: InChI=1S/C8H3Cl3F3N3O2S/c9-1-2(10)4-5(6(3(1)11)20(15,18)19)17-7(16-4)8(12,13)14/h16H,15H2
charge 0 multiplicity 1
23 atoms
Cl -4.257776 0.119582 0.311354
Cl -0.238401 4.009273 0.129538
Cl -3.389049 3.187874 0.331574
S  -1.941411 -2.369671 0.049979
F  3.687703 -1.221646 -1.469261
F  4.206866 0.79136 -0.529534
F  3.917018 -1.051439 0.773798
O  -1.528752 -2.823994 1.553685
O  -3.403047 -2.743548 -0.527617
N  1.566188 1.302193 -0.14625
N  0.967094 -0.898646 -0.225263
N  -0.782509 -2.88918 -1.234624
C  -0.188631 -0.10712 -0.093123
C  0.177879 1.277465 -0.046306
C  -1.551619 -0.474912 -0.017015
C  1.980463 -0.023184 -0.251523
C  -2.516428 0.529843 0.134667
C  -0.783435 2.29354 0.082159
C  -2.133799 1.916386 0.167946
C  3.428315 -0.390474 -0.367984
H  2.16663 2.12825 -0.154806
H  0.192495 -2.675012 -0.952306
H  -0.996393 -3.854039 -1.524985
