program: Gaussian 09
title: 000198641
version: EM64L-G09RevD.01
frameworkgroup: C1[X(C8HCl2F5N2)]
method: RPBEPBE
basis: SDD
operation: Freq
keyword: #p
keyword: freq=noraman
keyword: PBEPBE/SDD
title: #p freq=noraman PBEPBE/SDD
converged: NO NO NO NO
title: Mulliken charges:
elementType: Cl Cl F F F F F N N C C C C C C C C H
charge: 0.044761 0.077274 -0.135091 -0.110337 -0.152435 -0.152807 -0.145951 -0.418420 0.025939 0.602698 -0.147443 0.124199 -0.594917 0.376753 0.267282 0.628703 -0.644480 0.354272
chargesum: 0.00000
title: Mulliken charges with hydrogens summed into heavy atoms:
elementType: Cl Cl F F F F F N N C C C C C C C C
charge: 0.044761 0.077274 -0.135091 -0.110337 -0.152435 -0.152807 -0.145951 -0.064148 0.025939 0.602698 -0.147443 0.124199 -0.594917 0.376753 0.267282 0.628703 -0.644480
polarizability: 1.83542852e+02 -8.16614212e+00 1.39497404e+02 -3.23545045e-05 3.10217931e-03 5.17673772e+01
1716.lowfreq: -21.8527 -0.0029 -0.0014 -0.0014 2.0029 6.7211 7.1425 56.2113 94.1875
frequency: -21.6679 56.1978 94.1874 99.9728 106.2762 161.7157 171.1362 202.9554 205.8986 232.3641 273.2986 280.0571 294.4595 351.1387 362.8915 386.1351 404.0791 405.3378 489.4556 492.8205 519.0234 595.5349 618.6603 655.2616 657.8261 678.9438 706.1483 707.1712 785.6672 824.8016 903.8930 921.4083 975.0486 1023.6744 1041.1901 1092.2586 1101.2748 1223.2805 1269.2793 1322.5021 1360.3481 1385.7745 1415.1434 1479.7694 1520.8928 1587.0514 1645.9238 3576.6961
redmass: 18.5323 17.7883 19.5040 18.9011 15.3378 24.6889 12.8128 18.6747 8.4764 17.6699 18.8620 21.5093 13.9998 21.4342 10.3716 14.3527 13.3373 13.4939 14.9531 13.9431 15.4133 9.2302 3.7961 1.5673 15.6412 7.9262 11.5529 12.5323 12.4475 12.0366 11.6469 10.8319 12.1914 12.5874 8.6408 10.1250 5.1058 11.8942 2.2431 12.0761 8.9035 4.9524 10.3957 10.3831 6.3124 11.6489 10.2768 1.0823
irintensity: 0.4572 0.2065 0.7819 0.3174 3.1019 0.2827 0.6467 3.2121 4.4348 1.4839 0.2156 1.1005 0.3484 1.0593 2.2300 2.1796 0.2364 6.6780 14.5412 0.8865 12.7256 8.4904 20.9447 66.3793 2.3382 1.1847 44.0643 4.6501 34.4721 12.5002 48.4055 51.3799 272.2352 5.6569 204.6650 121.1716 60.3061 37.2171 439.7172 80.8511 22.1346 43.0596 3.7855 93.7889 50.8516 32.4741 19.0877 106.3441
temp: 298.150 k
press: 1.00000 atm
elementType: 17 17 9 9 9 9 9 7 7 6 6 6 6 6 6 6 6 1
symmnumber: 1
zpe: 219304.4 jmol-1
zpe.correction: 0.083529 hartree
zpe.thermalcorrener: 0.097283 hartree
zpe.thermalcorrenthalpy: 0.098227 hartree
zpe.thermalcorrgfe: 0.042014 hartree
zpe.sumelectzpe: -1833.058663 hartree
zpe.sumelectthermal: -1833.044909 hartree
zpe.sumelectthermalent: -1833.043965 hartree
zpe.sumelectthermalfe: -1833.100178 hartree
dipole: 0.0266 3.3558 -0.0055
dipole: 3.3559
quadrupole: -120.8732 -112.0281 -107.2538
quadrupole: -7.7460 0.0187 -0.0008
quadrupole: -7.4881 1.3569 6.1312 -7.7460 0.0187 -0.0008
hfenergy: -1833.142192 hartree
pointgroup: C01 [X(C8H1Cl2F5N2)]
dipole: -0.0634291 1.3187903 0.0043174 debye
dipolederiv: -0.0783957 -0.0415313 -0.0001323 0.0738555 -0.6503 -0.0010546 0.0000553 -0.001096 0.0274227 -0.5017103 -0.2419907 -0.0006959 -0.2788137 -0.1461882 -0.0004452 -0.0008001 -0.0004557 0.0339646 -0.160132 -0.0071138 -0.0000486 -0.064047 -0.987092 -0.0014307 -0.0001055 -0.00147 -0.0933179 -0.5656753 0.2344358 -0.0030063 0.2346113 -0.6315114 0.0059371 -0.0009494 0.0055774 -0.2559405 -0.7243348 -0.0844353 0.1640214 -0.2312408 -0.3886453 0.2188868 0.2355067 0.179865 -0.6325544 -0.7183827 -0.0878193 -0.1609215 -0.2361591 -0.3987758 -0.2246356 -0.2251941 -0.1849245 -0.6226152 -0.8402132 0.2778258 0.0000637 0.397329 -0.301691 -0.0001123 0.0001667 -0.000136 -0.1038602 -0.4946924 0.0443632 -0.0000028 -0.2499385 -0.5026124 -0.0005031 0.0004653 0.0004997 -0.2197922 -0.1301116 -0.124549 -0.0000773 0.0576644 -0.3798405 0.0000885 0.000291 -0.0009597 -0.1950506 0.3880403 0.0846597 0.0001797 0.2371054 -0.2473415 -0.0005449 0.0007231 -0.0004277 0.1608543 0.0299047 -0.0591278 0.0000112 -0.0261802 -0.0814075 -0.0001887 0.0004459 -0.0003074 -0.0287678 -0.5277542 -0.0964348 -0.0003781 -0.0551054 0.6277562 0.000771 -0.0057952 0.0008906 -0.0451882 -0.1019371 -0.0232505 -0.0000251 -0.1879227 0.9693345 0.0017269 -0.0003573 0.0016712 -0.1711291 0.3072117 -0.0753991 -0.0001008 -0.0181243 1.1603816 0.0015307 -0.0001156 0.0016494 0.1812186 2.4891252 -0.0412396 0.0001154 0.1231418 1.3979464 -0.0004016 -0.0053717 -0.0003582 1.5700264 0.7577446 -0.3271789 -0.0002382 -0.5033737 0.3230591 -0.0000846 -0.0004185 0.0000066 0.2114738 0.609005 0.5171114 0.0013257 0.6669033 -0.0178587 0.000606 0.0015858 0.000534 -0.1676597 0.2623079 0.0516742 -0.00009 0.0602946 0.2547864 -0.0001456 -0.0001325 -0.0005584 0.3509155 unknown
polarizability: 182.8172855|9.9052688|140.2227052|0.0703148|0.1465893|51.7676424 unknown
InChI: InChI=1S/C8HCl2F5N2/c9-1-3(11)2(10)5-6(4(1)12)17-7(16-5)8(13,14)15/h16H
charge 0 multiplicity 1
18 atoms
Cl -1.392647 3.243324 0.004337
Cl -4.193716 -1.574979 -0.005118
F  -1.428385 -2.820206 -0.005407
F  3.965582 -1.307251 0.017363
F  3.865292 0.652304 -1.140262
F  3.86356 0.681863 1.124494
F  -3.80983 1.388107 -0.000049
N  1.130548 1.084178 0.002352
N  1.137634 -1.208212 -0.001208
C  -0.207302 0.702275 0.000903
C  -0.185168 -0.735287 -0.001337
C  1.882547 -0.096315 0.001452
C  -1.401429 1.444318 0.001473
C  -1.413962 -1.435688 -0.00315
C  3.378428 -0.045773 0.000929
C  -2.596906 0.709554 -0.000389
C  -2.620679 -0.716399 -0.002725
H  1.485339 2.041488 0.00514
