program: Gaussian 09
title: 000198633
version: EM64L-G09RevD.01
frameworkgroup: C1[X(C8H3ClF4N2)]
method: RPBEPBE
basis: SDD
operation: Freq
keyword: #p
keyword: freq=noraman
keyword: PBEPBE/SDD
title: #p freq=noraman PBEPBE/SDD
converged: NO NO NO NO
title: Mulliken charges:
elementType: Cl F F F F N N C C C C C C C C H H H
charge: 0.009645 -0.115195 -0.157511 -0.158266 -0.172301 -0.427731 -0.009021 0.361633 0.015646 0.114701 -0.472974 -0.315298 0.264352 0.489745 -0.334300 0.342802 0.275929 0.288142
chargesum: 0.00000
title: Mulliken charges with hydrogens summed into heavy atoms:
elementType: Cl F F F F N N C C C C C C C C
charge: 0.009645 -0.115195 -0.157511 -0.158266 -0.172301 -0.084929 -0.009021 0.361633 0.015646 0.114701 -0.197046 -0.027156 0.264352 0.489745 -0.334300
polarizability: 1.83753936e+02 -6.27269166e+00 1.05455279e+02 5.07169942e-03 7.98907358e-03 4.92262132e+01
1716.lowfreq: -24.1924 -0.6850 -0.0026 -0.0026 -0.0021 7.7707 11.8745 59.8604 111.7259
frequency: -23.5835 59.8452 111.7259 117.9037 164.9128 201.1992 256.9106 279.7136 301.2961 316.1521 352.0858 394.7666 403.0305 429.6435 476.5696 498.9831 513.2446 583.0833 616.1258 650.0576 662.4684 674.7275 701.4864 748.4759 756.1247 834.2173 844.6415 886.3800 920.0695 967.0918 986.1238 1039.3870 1095.8744 1139.1054 1192.1059 1216.9466 1258.9127 1297.7564 1372.9204 1393.4827 1440.6625 1459.5321 1528.2805 1586.5581 1641.2920 3179.3456 3187.0472 3585.0661
redmass: 12.5255 14.6028 14.1982 8.8398 13.0170 18.2690 18.3037 14.7912 13.5898 5.2776 12.6905 11.8025 10.5052 3.0829 11.8320 10.8563 12.2902 6.0660 1.1962 14.7563 6.7593 7.4825 10.2311 3.4726 7.8009 4.3763 1.6808 1.4469 10.2013 12.0607 4.8561 10.4354 5.7070 1.8866 3.6276 1.6318 2.4651 5.5287 7.4942 4.1581 4.5493 6.9509 5.7294 9.3346 8.0741 1.0941 1.0940 1.0822
irintensity: 1.3691 0.3915 1.8936 5.6898 0.0738 1.6689 1.3453 1.2017 0.8903 2.6064 3.4404 0.0231 3.9774 17.0242 28.1374 0.2350 6.5068 8.4652 80.1349 1.0581 0.4099 20.6487 0.3948 0.1203 8.2968 3.2367 39.8043 27.1481 54.7254 284.1084 3.7127 284.5334 158.5311 36.4469 0.0098 23.1128 388.0167 43.2891 50.4790 24.0853 21.0445 2.8577 83.4449 55.6848 10.7326 0.4343 1.4044 94.1071
temp: 298.150 k
press: 1.00000 atm
elementType: 17 9 9 9 9 7 7 6 6 6 6 6 6 6 6 1 1 1
symmnumber: 1
zpe: 265112.4 jmol-1
zpe.correction: 0.100976 hartree
zpe.thermalcorrener: 0.112401 hartree
zpe.thermalcorrenthalpy: 0.113345 hartree
zpe.thermalcorrgfe: 0.062731 hartree
zpe.sumelectzpe: -1274.520846 hartree
zpe.sumelectthermal: -1274.509421 hartree
zpe.sumelectthermalent: -1274.508477 hartree
zpe.sumelectthermalfe: -1274.559091 hartree
dipole: 0.0456 3.1584 -0.0119
dipole: 3.1588
quadrupole: -110.4648 -83.8627 -92.3002
quadrupole: -8.3034 0.0348 -0.0045
quadrupole: -14.9222 11.6798 3.2424 -8.3034 0.0348 -0.0045
hfenergy: -1274.6218218 hartree
pointgroup: C01 [X(C8H3Cl1F4N2)]
dipole: -0.0958061 1.2390182 0.0089663 debye
dipolederiv: -0.617194 -0.220476 -0.0011673 -0.3265494 -0.1875257 -0.00079 -0.00158 -0.0007701 -0.0171856 -0.572078 0.2275961 -0.0056893 0.2453769 -0.6448699 0.0116141 -0.0012402 0.0108792 -0.258816 -0.7576803 -0.0996088 0.1724078 -0.2472935 -0.3963709 0.2168978 0.2638663 0.1855916 -0.6440654 -0.7457242 -0.1068904 -0.1663853 -0.2584428 -0.41671 -0.2280754 -0.2414497 -0.1953072 -0.6240854 -0.8964914 0.3324965 0.0005779 0.4567174 -0.388733 -0.0005697 0.0008393 -0.0005839 -0.1252783 -0.4679112 0.0327152 0.0001641 -0.2477682 -0.5242297 -0.0008838 0.0011535 0.0010653 -0.2331807 -0.0871493 -0.1948589 -0.0003967 0.0850057 -0.3786498 0.0001708 0.0007951 -0.001878 -0.218682 0.3913368 0.0996713 0.0004253 0.2351534 0.0035503 -0.000137 0.0015167 0.0000642 0.0801403 0.0751925 0.0613378 0.0004516 -0.0319824 -0.0470679 -0.000369 0.0009424 -0.0003184 0.0056297 -0.6674932 -0.0957909 -0.00059 -0.0765858 0.6430445 0.0017456 -0.0118388 0.0018318 -0.0638889 -0.1355438 0.0032435 -0.0000482 -0.1284197 -0.0578242 0.0002552 -0.0005845 0.0001797 -0.1762732 0.0094556 -0.0869353 -0.000387 -0.0340021 0.0239601 0.0002565 -0.000372 0.0002694 -0.0517905 2.5645079 0.0098993 -0.0002054 0.1397048 1.4210711 -0.0008238 -0.0134181 -0.0007787 1.5768786 0.7250766 -0.4248002 -0.0009361 -0.6562239 0.5481332 0.0010227 -0.0016141 0.0010357 0.1289663 0.7757596 0.4335372 0.0022091 0.7993067 0.1153422 0.0012251 0.0033558 0.0011275 -0.1146997 0.2254663 0.041863 -0.0002212 0.0560381 0.2405358 -0.000421 -0.000301 -0.0013292 0.3557865 0.0717358 -0.0164791 -0.0001606 0.0088009 0.0061655 -0.0006599 -0.0000494 -0.0006664 0.2076193 0.1087342 0.0034796 -0.0000488 -0.018836 0.0401786 -0.0004582 -0.0000214 -0.0004125 0.172925 unknown
polarizability: 182.6610321|11.1228703|106.5474966|0.0899399|0.1955028|49.2268992 unknown
InChI: InChI=1S/C8H3ClF4N2/c9-3-1-5-6(2-4(3)10)15-7(14-5)8(11,12)13/h1-2,15H
charge 0 multiplicity 1
18 atoms
Cl -4.391705 -1.516334 -0.00842
F  3.766919 -1.313033 0.031563
F  3.689751 0.634007 -1.149112
F  3.688502 0.691631 1.11398
F  -3.981756 1.445469 0.001767
N  0.95792 1.111656 0.004643
N  0.934943 -1.1821 -0.002642
C  -0.390079 0.74757 0.002237
C  -0.386652 -0.691856 -0.002413
C  1.694321 -0.0803 0.002129
C  -1.582103 1.498905 0.003934
C  -1.603971 -1.412392 -0.005715
C  3.188065 -0.046103 -0.000007
C  -2.76755 0.753073 0.000496
C  -2.794186 -0.673244 -0.004286
H  1.342024 2.056503 0.010356
H  -1.624146 2.590965 0.007527
H  -1.609397 -2.504918 -0.009235
