program: Gaussian 09
title: 000198632
version: EM64L-G09RevD.01
frameworkgroup: C1[X(C14H9F3N2)]
method: RPBEPBE
basis: SDD
operation: Freq
keyword: #p
keyword: freq=noraman
keyword: PBEPBE/SDD
title: #p freq=noraman PBEPBE/SDD
converged: NO YES NO NO
title: Mulliken charges:
elementType: F F F N N C C C C C C C C C C C C C C H H H H H H H H H
charge: -0.116902 -0.161327 -0.161704 -0.440994 -0.013142 0.332375 -0.003215 0.310824 -0.509307 0.105026 0.258533 -0.322465 -0.371578 0.244630 -0.381622 -0.381632 -0.219540 -0.219539 -0.237891 0.261072 0.336266 0.257185 0.252133 0.245959 0.245955 0.229670 0.229669 0.231562
chargesum: 0.00000
title: Mulliken charges with hydrogens summed into heavy atoms:
elementType: F F F N N C C C C C C C C C C C C C C
charge: -0.116902 -0.161327 -0.161704 -0.104728 -0.013142 0.332375 -0.003215 0.310824 -0.248235 0.105026 0.258533 -0.065280 -0.119445 0.244630 -0.135663 -0.135677 0.010130 0.010130 -0.006329
polarizability: 2.63155829e+02 5.53444229e+00 1.27900160e+02 1.14403086e-02 -1.32518680e-02 1.12928805e+02
1716.lowfreq: -57.7979 -26.1384 -7.3573 -0.0009 -0.0007 0.0008 3.6917 3.9349 40.2405
frequency: -57.7828 -26.0352 39.9209 57.1091 91.7331 130.3923 203.0040 211.8227 235.9059 261.1791 329.4430 330.3103 341.0937 397.1118 410.1720 433.9261 445.3469 500.0971 529.2204 550.4290 572.3644 606.2646 613.2571 627.9699 655.9218 661.8054 699.7690 705.7177 722.7326 767.9187 774.3166 806.4032 837.2238 852.4251 879.2470 909.8495 918.9313 921.6154 958.8981 968.2085 973.6543 987.9120 995.9378 1008.6619 1033.8020 1039.7903 1077.7128 1098.7279 1128.7022 1172.8417 1186.9409 1200.1908 1217.4135 1263.7842 1277.4018 1308.2269 1309.0404 1368.2997 1368.6723 1379.9946 1428.0485 1434.6827 1470.2923 1501.3709 1522.4955 1580.9812 1583.4798 1612.4168 1639.0904 3124.5227 3129.6099 3141.7054 3147.8477 3150.7144 3153.3211 3166.0304 3175.8305 3591.4266
redmass: 4.0248 9.4776 6.4160 6.2364 8.0775 8.4065 8.0231 8.6032 4.7684 5.7433 6.7747 7.1260 9.0045 2.8339 7.1888 7.5037 3.2144 10.1948 4.0380 6.9618 8.2567 1.8774 2.1570 6.2444 11.7288 3.7182 10.4614 1.7307 5.9243 2.0400 3.8819 5.0890 1.5173 1.2467 1.5263 4.3715 4.8257 1.7924 10.5880 1.3651 1.3822 6.1111 1.3129 3.1319 3.8897 2.4997 1.6029 5.3458 1.5793 1.0532 1.1190 2.1296 2.3475 2.0596 2.4593 2.4963 1.3730 5.0520 6.7857 5.3136 2.2004 3.6588 2.5441 4.5766 4.5717 8.1282 5.9955 6.2452 7.5802 1.0846 1.0878 1.0925 1.0891 1.0969 1.0932 1.1018 1.0970 1.0819
irintensity: 0.8477 0.7276 0.8422 0.0057 0.0259 1.6774 0.0326 0.5379 10.2498 4.0043 0.0229 1.4678 10.2258 0.0004 1.5524 5.0857 11.8771 0.2208 12.3073 4.7688 4.8300 24.5386 37.1068 5.9859 2.1789 23.0339 0.7118 55.5297 1.6983 38.6378 0.0023 7.7184 37.6892 0.8158 17.6417 5.6441 63.0864 16.3275 269.4535 8.5148 0.1425 1.7922 0.0658 16.5293 132.9762 88.7019 7.4849 168.9767 5.1552 0.0218 3.6020 58.1189 15.2406 65.6435 213.0955 58.5820 0.6309 10.8300 0.0733 47.9217 7.7928 5.6572 12.0375 38.9906 71.2441 45.6187 1.5134 7.6596 19.7548 2.5068 0.0530 16.8234 3.7679 36.4996 3.3481 24.9341 5.4387 79.2710
temp: 298.150 k
press: 1.00000 atm
elementType: 9 9 9 7 7 6 6 6 6 6 6 6 6 6 6 6 6 6 6 1 1 1 1 1 1 1 1 1
symmnumber: 1
zpe: 519841.0 jmol-1
zpe.correction: 0.197997 hartree
zpe.thermalcorrener: 0.211293 hartree
zpe.thermalcorrenthalpy: 0.212237 hartree
zpe.thermalcorrgfe: 0.157180 hartree
zpe.sumelectzpe: -946.618253 hartree
zpe.sumelectthermal: -946.604957 hartree
zpe.sumelectthermalent: -946.604013 hartree
zpe.sumelectthermalfe: -946.659070 hartree
dipole: -4.8855 -2.2456 -0.0093
dipole: 5.3769
quadrupole: -117.3708 -104.3326 -105.6853
quadrupole: -3.2614 -0.0326 0.0043
quadrupole: -8.2412 4.7969 3.4443 -3.2614 -0.0326 0.0043
hfenergy: -946.8162501 hartree
pointgroup: C01 [X(C14H9F3N2)]
dipole: -1.9287406 0.8689066 0.0027729 debye
polarizability: 263.2319086|-4.5093432|127.8240356|-0.0087966|-0.0290437|112.9288501 unknown
InChI: InChI=1S/C14H9F3N2/c15-14(16,17)13-18-11-7-6-10(8-12(11)19-13)9-4-2-1-3-5-9/h1-8,19H
charge 0 multiplicity 1
28 atoms
F  5.393957 -0.605914 0.017969
F  4.796084 1.259351 -1.142576
F  4.787447 1.292582 1.119963
N  2.036823 0.976674 0.00112
N  2.625601 -1.238879 0.001004
C  0.830606 0.266129 0.000722
C  1.218865 -1.118817 0.000601
C  -1.500935 -0.340351 0.000143
C  -0.518615 0.675341 0.000597
C  3.065431 0.026405 0.001416
C  -2.959213 0.022762 -0.000197
C  0.227543 -2.127375 0.000185
C  -1.119304 -1.723574 -0.00008
C  4.493097 0.455387 -0.000503
C  -3.659255 0.195413 -1.222654
C  -3.660277 0.193677 1.221918
C  -5.031895 0.532978 -1.222936
C  -5.032919 0.531239 1.221529
C  -5.722862 0.702139 -0.000871
H  -0.81344 1.729325 0.000753
H  2.153432 1.98925 0.002599
H  0.512522 -3.183172 0.000047
H  -1.911794 -2.479027 -0.000478
H  -3.125949 0.063076 -2.170944
H  -3.127766 0.059991 2.170466
H  -5.559579 0.662874 -2.174458
H  -5.561401 0.659776 2.172793
H  -6.786906 0.963537 -0.00113
