program: Gaussian 09
title: 000198626
version: EM64L-G09RevD.01
frameworkgroup: C1[X(C11H10N2O3)]
method: RPBEPBE
basis: SDD
operation: Freq
keyword: #p
keyword: freq=noraman
keyword: PBEPBE/SDD
title: #p freq=noraman PBEPBE/SDD
converged: YES YES NO NO
title: Mulliken charges:
elementType: O O O N N C C C C C C C C C C C H H H H H H H H H H
charge: -0.294323 -0.219794 -0.219801 -0.037426 0.023828 0.261977 0.197596 0.535224 -0.559226 -0.542535 0.236459 -0.374920 -0.370409 -0.269127 -0.256574 -0.672861 0.315398 0.214189 0.227268 0.299109 0.249874 0.288473 0.289148 0.230367 0.226788 0.221297
chargesum: 0.00000
title: Mulliken charges with hydrogens summed into heavy atoms:
elementType: O O O N N C C C C C C C C C C C
charge: -0.294323 -0.219794 -0.219801 -0.037426 0.023828 0.261977 0.197596 0.535224 -0.243828 -0.101078 0.236459 -0.075811 -0.120535 0.019346 0.032574 0.005592
polarizability: 2.18369560e+02 -1.39712426e+00 2.06602750e+02 8.12787850e+00 2.45335069e+00 6.71194225e+01
1716.lowfreq: -8.3904 -6.3978 -2.9363 -0.0003 -0.0003 0.0003 30.4911 35.0678 69.5367
frequency: 30.4397 35.0664 69.5346 98.2162 141.3650 170.8522 199.8266 226.6200 285.0903 314.1772 320.1931 347.1205 371.2921 398.2956 424.4023 470.8829 520.7749 534.2824 594.6203 604.9824 636.3969 646.2032 681.8836 703.5191 724.5532 760.2625 769.6360 790.9288 835.6259 854.1784 869.2768 939.0285 966.9122 968.0621 995.0313 997.4849 1050.6257 1055.4966 1072.1380 1126.7647 1156.4640 1177.4280 1190.5442 1227.0709 1238.7575 1243.1289 1270.5956 1304.0508 1309.7277 1336.5334 1364.0495 1390.1617 1398.6795 1419.9832 1456.2162 1472.6992 1475.6112 1489.3645 1516.2320 1544.4436 1591.9979 1618.9077 2984.1414 2991.2008 3048.4742 3084.0381 3089.3560 3137.0170 3182.9669 3191.7917 3198.8171 3219.0057
redmass: 2.7218 10.7908 4.2522 7.6847 4.1653 2.3120 4.1986 1.5232 4.4811 6.6527 6.2379 5.3541 4.1548 6.5862 3.5494 4.4715 4.5118 5.4810 5.4222 6.0189 8.8969 3.4173 4.6249 4.8017 6.8979 4.7351 7.1794 1.2330 1.4590 1.4922 4.1112 1.3950 1.3367 2.8416 2.3878 1.3536 2.9934 2.0633 1.5711 1.6144 2.0240 1.5881 5.0306 2.2228 1.9641 1.9545 2.1612 2.4160 1.4753 6.2922 3.5732 1.1988 4.8743 2.8374 2.8890 1.0559 1.0770 1.1009 5.4273 6.5935 7.3245 6.7944 1.0348 1.0616 1.1003 1.1002 1.1013 1.0907 1.0944 1.0901 1.0917 1.0967
irintensity: 0.0548 0.1949 2.1542 6.3247 2.7901 1.3964 0.2017 1.5260 5.4065 0.0579 0.2301 0.6997 2.1105 3.5344 4.0727 5.1623 5.8233 5.5715 4.4255 0.2442 9.4356 0.9158 1.4974 16.8629 9.5312 0.3287 1.5031 3.9681 57.5205 33.6029 16.0302 13.5656 2.0843 4.2379 15.1544 3.1438 13.5682 21.0467 4.7682 26.7358 63.1808 99.7723 307.5711 38.2844 42.0491 107.0290 18.7318 3.6129 1.9854 72.1540 36.7553 8.9687 37.5896 1.0835 15.0533 17.2245 5.1134 13.2083 48.1011 3.3299 65.2848 44.4538 34.8793 26.5424 3.2718 47.3432 35.2268 12.1422 3.4326 4.8272 11.3948 2.9637
temp: 298.150 k
press: 1.00000 atm
elementType: 8 8 8 7 7 6 6 6 6 6 6 6 6 6 6 6 1 1 1 1 1 1 1 1 1 1
symmnumber: 1
zpe: 507943.4 jmol-1
zpe.correction: 0.193465 hartree
zpe.thermalcorrener: 0.207025 hartree
zpe.thermalcorrenthalpy: 0.207969 hartree
zpe.thermalcorrgfe: 0.151817 hartree
zpe.sumelectzpe: -759.085431 hartree
zpe.sumelectthermal: -759.071871 hartree
zpe.sumelectthermalent: -759.070926 hartree
zpe.sumelectthermalfe: -759.127079 hartree
dipole: -2.9760 2.0626 -0.0659
dipole: 3.6215
quadrupole: -78.4907 -114.3889 -93.5658
quadrupole: 6.0269 1.4551 -0.4759
quadrupole: 16.9911 -18.9071 1.9160 6.0269 1.4551 -0.4759
hfenergy: -759.2788959 hartree
pointgroup: C01 [X(C11H10N2O3)]
dipole: -1.1155865 0.8858506 0.0277572 debye
dipolederiv: -0.3743508 -0.0001839 -0.0034468 -0.1898866 -1.1476064 -0.0614469 -0.0193449 -0.0537611 -0.2821874 -0.8244854 0.5221501 0.0007724 0.3331466 -0.7570385 -0.0140934 -0.0177287 0.0053134 -0.2397172 -0.5900955 -0.3754465 -0.0444083 -0.0953856 -0.7924812 -0.0436454 -0.0275567 -0.059786 -0.2356994 0.5211154 -0.1594893 0.0041053 0.2504046 1.0797031 0.0690043 0.0459586 0.0456128 0.1354634 1.0772247 -0.1544329 0.0393369 -0.372551 2.1178706 0.1034392 0.0316393 0.1045487 0.1898654 0.3622533 -0.2299795 -0.0045747 0.2838928 0.0388424 0.0104515 0.0421032 -0.0183278 0.1025398 -0.183874 -0.3425087 -0.0181739 -0.3528786 -0.1917213 -0.0285829 -0.0369 -0.0400854 0.000224 0.5848209 0.1202864 -0.0046511 0.2560131 0.2131781 0.000214 0.0279515 0.0179353 -0.05365 -0.5227269 0.1143193 0.013173 0.0949395 -0.0038695 0.0165253 -0.028872 0.011776 -0.1477757 -0.111156 -0.0590465 0.049568 -0.0024108 0.1219582 0.0023096 0.2304208 0.0221758 0.0674069 -0.0136017 -0.1448985 -0.0064555 0.1330051 -1.0153887 -0.0571306 0.00675 -0.0725814 0.0063871 0.0000777 0.1247967 0.0103963 -0.0743478 -0.0150955 -0.0038332 0.0115275 0.0177401 -0.1120311 -0.0751854 -0.2205648 0.0073743 -0.2903192 -0.0461465 0.0020927 -0.0242295 -0.0126218 -0.1380049 -0.1275069 0.2720271 0.0145203 -0.0731859 0.5045711 0.0314991 -0.0102194 0.051422 -0.0428726 -0.0555504 0.4705119 0.0424532 0.161856 -0.4013322 -0.0063834 0.0169167 0.0212038 -0.1395839 -0.0100868 -0.0123497 0.0340523 -0.0701579 0.0651424 0.0041276 -0.1353352 -0.0226788 0.020984 0.1582571 0.0077974 -0.0062349 -0.0994062 0.0580011 -0.0108834 -0.0102228 -0.0037876 0.1513157 -0.0372083 0.0172616 -0.0720783 0.0386113 0.0121737 0.111971 -0.0842219 0.0609169 -0.0371748 0.0332796 0.0553453 0.041958 -0.0317359 -0.0891841 -0.0953812 0.009305 -0.0558882 0.032696 0.1194195 -0.0856572 -0.0078365 0.0237467 0.0502057 -0.003671 -0.0039103 -0.0130465 0.1693403 -0.0522898 0.0932018 -0.0136407 0.0845727 0.052557 -0.0046479 -0.0143699 -0.0021387 0.1373871 0.0940728 0.0048246 -0.0055388 0.0484783 0.1260491 0.0018238 -0.0027297 -0.0013543 0.1643996 0.0713059 0.0055458 -0.0088994 -0.0300987 0.0532515 -0.0107765 -0.0115144 -0.0076413 0.1848037 0.0454298 0.0883802 -0.0916756 0.0583516 0.0261632 0.0914732 -0.0393248 0.0618742 -0.0339376 -0.2067694 -0.1105879 0.0120989 -0.131099 0.0578811 -0.0036314 0.0378587 -0.0061042 0.0658899 0.1176307 -0.0013029 0.0178057 0.0464451 -0.1176844 -0.1008243 0.0060487 -0.0507158 0.0339319 unknown
polarizability: 218.3800982|-2.334049|206.4766367|5.5395271|7.3403782|67.2349969 unknown
InChI: InChI=1S/C11H10N2O3/c1-2-8-3-4-10-9(7-8)11(13(15)16)5-6-12(10)14/h3-7H,2H2,1H3
charge 0 multiplicity 1
26 atoms
O  1.545297 3.253623 0.223886
O  2.741564 -2.882915 -0.075737
O  0.480078 -3.087946 -0.231074
N  1.505081 1.932445 0.137631
N  1.551978 -2.365713 -0.121605
C  0.181965 -0.180511 -0.098435
C  0.249878 1.260944 -0.00331
C  -2.282924 0.037652 -0.287967
C  -1.124021 -0.753753 -0.244441
C  -3.656768 -0.601658 -0.402899
C  1.436449 -0.901946 -0.043438
C  -0.917057 2.06745 -0.049975
C  -2.165336 1.461213 -0.188626
C  2.646195 -0.198599 0.094415
C  2.671211 1.196052 0.182842
C  -4.396865 -0.643206 0.96253
H  -1.202589 -1.838287 -0.322326
H  -4.272713 -0.033893 -1.127098
H  -3.562055 -1.630213 -0.795462
H  -0.792451 3.150669 0.02115
H  -3.06898 2.080224 -0.230577
H  3.583189 -0.757636 0.133473
H  3.582607 1.78397 0.291355
H  -3.829731 -1.239825 1.698936
H  -5.397267 -1.097279 0.847087
H  -4.528035 0.37234 1.378464
