program: Gaussian 09
title: 000198624
version: EM64L-G09RevD.01
frameworkgroup: C1[X(C12H12N2O3)]
method: RPBEPBE
basis: SDD
operation: Freq
keyword: #p
keyword: freq=noraman
keyword: PBEPBE/SDD
title: #p freq=noraman PBEPBE/SDD
converged: YES YES NO NO
title: Mulliken charges:
elementType: O O O N N C C C C C C C C C C C C H H H H H H H H H H H H
charge: -0.294514 -0.217461 -0.221957 -0.112988 0.022768 0.364414 -0.506428 0.150141 0.264143 -0.350322 -0.458589 0.282907 -0.378637 -0.347891 -0.687051 -0.211469 -0.245646 0.215712 0.241163 0.237207 0.205805 0.295694 0.305502 0.307759 0.210934 0.218684 0.226102 0.243139 0.240874
chargesum: 0.00000
title: Mulliken charges with hydrogens summed into heavy atoms:
elementType: O O O N N C C C C C C C C C C C C
charge: -0.294514 -0.217461 -0.221957 -0.112988 0.022768 0.364414 -0.049552 0.150141 0.264143 0.092690 -0.162894 0.282907 -0.073135 -0.040131 -0.031330 0.031671 -0.004772
polarizability: 2.34769493e+02 1.31059419e+00 2.13895956e+02 1.29434546e+01 -5.77451001e-01 7.65116705e+01
1716.lowfreq: -9.0654 -6.5439 -2.8116 -0.0010 -0.0003 0.0003 31.2357 46.1844 55.0507
frequency: 31.2206 46.1107 55.0394 74.6106 103.6157 133.3419 185.3787 213.3111 234.8773 263.8673 275.8712 283.6416 340.4714 358.2369 383.0434 408.5380 418.5845 477.3023 504.7733 551.8512 560.0297 618.3994 633.6621 680.2251 695.3361 707.6678 734.8354 745.6687 764.7809 786.5532 789.6601 869.8143 882.8040 897.6227 943.0685 954.6805 975.5950 991.4604 1011.3652 1034.3736 1050.4534 1079.8874 1088.4029 1100.5692 1158.7801 1177.7719 1191.9191 1203.1580 1226.3337 1242.6078 1271.0783 1274.4223 1294.8593 1306.5074 1335.8673 1343.3956 1362.3371 1391.7260 1393.3564 1423.3872 1442.2509 1454.8773 1474.1902 1478.3525 1484.0591 1517.6019 1546.8304 1600.0410 1617.2605 2976.1069 2989.7313 3001.9907 3043.8101 3064.7434 3079.0471 3082.8541 3145.1008 3163.9921 3186.6534 3188.9120 3213.5354
redmass: 13.8514 3.9150 4.6173 1.9157 3.7908 4.8495 4.8369 4.9861 1.2228 3.7810 3.5997 3.2105 10.7397 5.0279 6.3795 10.5782 3.4048 5.4426 4.8594 5.1428 4.5656 6.5761 4.5435 5.8247 6.8618 4.9627 4.2676 1.4075 3.9330 4.2363 1.5146 1.4817 1.8087 1.4028 1.3581 5.7520 5.8498 1.3476 1.3235 2.0194 3.0354 1.9382 2.0401 1.8928 1.4142 1.7345 3.5569 1.8565 1.5632 2.9595 1.7697 1.4898 1.2950 3.6133 1.4635 6.5943 2.7486 1.2101 4.5501 3.0266 2.3539 1.1934 1.0601 1.0440 1.0733 5.4991 6.5021 7.8804 6.6135 1.0358 1.0610 1.0597 1.0985 1.1019 1.0991 1.1032 1.0879 1.0939 1.0916 1.0957 1.0939
irintensity: 0.0774 0.9341 1.9836 0.6534 2.4409 3.3451 0.1561 3.5956 0.5641 0.5892 2.0037 0.3445 1.7340 5.7404 1.2150 5.1389 2.4667 1.4437 6.5934 3.2852 9.4057 2.3605 8.8093 6.5540 3.6305 8.5809 3.3998 11.3288 23.5538 0.9785 69.5417 4.7893 4.8850 0.0326 11.3571 5.2890 17.4676 5.0735 0.1081 13.2771 1.9244 4.6930 26.5591 39.1383 17.5916 172.6815 328.3488 28.1158 16.0215 57.5124 11.2094 13.9800 3.5150 46.0752 13.1907 88.5890 38.7457 8.8896 7.9809 8.4432 12.6143 6.3638 3.3445 15.0449 15.7516 39.0097 20.0897 21.7489 3.2016 42.4102 8.1107 32.8880 0.8915 3.2209 41.0068 48.3000 7.8239 14.3576 5.5926 6.5578 10.4161
temp: 298.150 k
press: 1.00000 atm
elementType: 8 8 8 7 7 6 6 6 6 6 6 6 6 6 6 6 6 1 1 1 1 1 1 1 1 1 1 1 1
symmnumber: 1
zpe: 581923.7 jmol-1
zpe.correction: 0.221643 hartree
zpe.thermalcorrener: 0.236515 hartree
zpe.thermalcorrenthalpy: 0.237459 hartree
zpe.thermalcorrgfe: 0.178401 hartree
zpe.sumelectzpe: -798.313353 hartree
zpe.sumelectthermal: -798.298481 hartree
zpe.sumelectthermalent: -798.297537 hartree
zpe.sumelectthermalfe: -798.356596 hartree
dipole: -1.2467 -3.0979 0.1051
dipole: 3.3410
quadrupole: -92.7504 -110.2751 -99.9006
quadrupole: -19.2592 0.4007 -2.0627
quadrupole: 8.2249 -9.2997 1.0748 -19.2592 0.4007 -2.0627
hfenergy: -798.5349965 hartree
pointgroup: C01 [X(C12H12N2O3)]
dipole: -0.4003079 -1.2476723 0.1039967 debye
polarizability: 234.6584376|3.368212|213.91575|11.5928742|-6.2201275|76.6029317 unknown
InChI: InChI=1S/C12H12N2O3/c1-2-5-9-8-12(14(16)17)10-6-3-4-7-11(10)13(9)15/h3-4,6-8H,2,5H2,1H3
charge 0 multiplicity 1
29 atoms
O  -1.584911 -2.179529 -0.285856
O  0.647171 3.66942 -0.255918
O  2.659624 2.653871 0.05118
N  -0.862487 -1.065102 -0.242428
N  1.374647 2.604743 -0.113022
C  -1.48258 0.171317 -0.385169
C  -2.976444 0.179219 -0.56559
C  0.552861 -1.155938 -0.050769
C  1.375633 0.030135 0.005466
C  -3.752646 -0.075184 0.762343
C  -0.693068 1.333586 -0.334006
C  0.696617 1.298064 -0.143726
C  1.103292 -2.457822 0.080706
C  2.783649 -0.167924 0.201886
C  -5.277555 -0.076317 0.531447
C  2.479818 -2.607264 0.270792
C  3.316324 -1.455096 0.330678
H  -3.281076 1.155216 -0.984752
H  -3.257917 -0.612269 -1.28561
H  -3.434089 -1.04798 1.178504
H  -3.482335 0.706928 1.498353
H  -1.180024 2.304569 -0.447105
H  0.4207 -3.308878 0.028711
H  3.429812 0.707703 0.247902
H  -5.622007 0.88805 0.112319
H  -5.570311 -0.876467 -0.173535
H  -5.820591 -0.245851 1.478575
H  2.913199 -3.607275 0.373407
H  4.394592 -1.574626 0.479615
