program: Gaussian 09
title: 000198618
version: EM64L-G09RevD.01
frameworkgroup: C1[X(C13H24O2)]
method: RPBEPBE
basis: SDD
operation: Freq
keyword: #pfreq=noraman
keyword: PBEPBE/SDD
title: #p freq=noraman PBEPBE/SDD
converged: YES YES NO NO
title: Mulliken charges:
elementType: O O C C C C C C C C C C C C C H H H H H H H H H H H H H H H H H H H H H H H H
charge: -0.318985 -0.260430 0.464114 -0.514883 -0.494839 -0.485669 -0.407948 -0.401955 -0.388939 -0.383436 -0.350393 -0.359664 0.289021 -0.697577 -0.768760 0.229437 0.195283 0.198091 0.256827 0.248494 0.200568 0.215969 0.194756 0.196654 0.206988 0.186446 0.203184 0.203028 0.201491 0.184845 0.196271 0.196186 0.193563 0.209533 0.214883 0.211867 0.243496 0.249238 0.243247
chargesum: 0.00000
title: Mulliken charges with hydrogens summed into heavy atoms:
elementType: O O C C C C C C C C C C C C C
charge: -0.318985 -0.260430 0.464114 -0.090163 -0.039922 -0.036607 0.002777 0.001687 0.000691 0.021082 0.030723 0.030085 0.289021 -0.061294 -0.032780
polarizability: 1.59432191e+02 -3.55204118e+00 1.42074459e+02 -1.22455261e+00 -5.55289614e-01 1.28053809e+02
1716.lowfreq: -67.8503 -9.4188 -0.0007 -0.0006 -0.0003 6.2628 19.7259 28.9319 34.2153
frequency: -67.8270 28.5127 33.6144 62.3947 72.8010 81.9261 100.9535 120.7416 136.3926 169.3891 202.6739 221.5890 233.7170 239.1129 275.0627 312.1441 333.0825 350.4270 390.6628 430.9858 452.3963 458.2945 495.6328 570.2470 583.7733 616.5914 721.0053 722.7892 744.1556 769.9287 784.1319 829.3351 845.5379 872.4896 892.7303 898.9750 909.7920 928.7686 955.2495 964.7590 996.8625 1009.5516 1043.3552 1047.1606 1055.6467 1063.2040 1076.8306 1081.3089 1099.6241 1115.5585 1132.2589 1148.0296 1151.8572 1198.7650 1202.3393 1222.1613 1249.0059 1253.2192 1262.9350 1272.8240 1283.7485 1289.0519 1308.5601 1317.5745 1326.9713 1338.2876 1342.0730 1343.4568 1351.8098 1364.1290 1366.7408 1379.8014 1389.1728 1447.7506 1452.9763 1453.8831 1457.5788 1459.7227 1461.6271 1463.5880 1467.9077 1470.1503 1476.2771 1477.3302 1480.7968 1487.8812 1625.7441 2952.1655 2961.2474 2963.3000 2969.9771 2971.4609 2972.6262 2976.2889 2981.4219 2981.8056 2986.3223 2991.8634 3005.7292 3013.8468 3027.9607 3032.9816 3038.1337 3045.2803 3055.7141 3055.9409 3065.0685 3068.1862 3070.1413 3094.1127 3136.2582
redmass: 1.0293 2.1521 2.6673 3.7936 3.1671 3.5987 2.8013 1.8488 2.9021 3.0904 3.3071 3.0847 1.1152 3.1529 2.6253 2.8162 2.7151 1.8968 2.7207 2.6492 2.3258 3.3495 2.2577 2.8118 3.6142 2.9787 3.2135 1.2473 1.2757 1.5032 2.2213 1.3530 2.1816 1.8095 2.0339 2.4487 2.6632 1.6392 1.8480 1.4748 1.7410 3.5524 1.6633 2.4342 1.9769 1.5182 1.9381 1.6249 1.5538 1.8948 2.2540 1.8746 2.1423 1.9303 2.4625 1.6457 1.3721 1.3631 1.2635 1.2643 1.2299 1.0594 1.3438 1.2955 1.5703 1.3808 1.5476 1.5023 1.5939 1.5281 1.4959 1.2266 1.2173 1.0858 1.0787 1.0675 1.0473 1.0865 1.0894 1.0683 1.0807 1.0789 1.0912 1.0427 1.0771 1.0851 9.5682 1.0592 1.0633 1.0591 1.0610 1.0379 1.0636 1.0632 1.0633 1.0620 1.0627 1.0971 1.0362 1.1004 1.0956 1.1012 1.1010 1.0999 1.0998 1.0999 1.0966 1.1006 1.0994 1.0972 1.1013
irintensity: 0.9053 0.0109 0.3052 2.9078 0.3861 2.0198 0.1076 0.1036 1.0651 0.3006 1.9620 5.4165 0.0350 0.1599 2.2192 3.0316 0.9229 0.7937 0.6834 4.2193 1.5918 1.9045 2.6379 3.5478 2.2574 4.3606 11.4721 5.5195 2.2601 0.8967 4.4019 0.4816 7.4861 3.4431 18.5254 40.0086 3.7863 21.6083 28.7273 0.9081 34.0536 2.4926 11.4451 0.2278 2.8088 0.8435 0.8141 0.6053 0.7765 11.8190 5.7373 5.5485 84.7948 91.6912 197.7997 16.3512 4.0249 6.2979 2.1851 1.8355 0.4488 0.5489 4.1547 1.8887 4.5650 0.1647 3.5354 1.6908 0.5377 4.1252 6.3911 51.4526 10.9846 6.3684 0.7006 13.2427 14.1005 9.1951 13.5053 1.8582 12.3770 16.3716 6.0584 11.6381 6.4417 22.1281 163.0700 6.9984 39.2681 25.7516 28.9281 32.4767 9.9760 39.4732 33.8015 65.4847 36.9545 2.1332 4.2812 1.8403 68.8570 39.1198 44.7243 42.5210 65.6107 16.2231 23.3260 101.9508 54.8944 8.1329 10.1090
temp: 298.150 k
press: 1.00000 atm
elementType: 8 8 6 6 6 6 6 6 6 6 6 6 6 6 6 1 1 1 1 1 1 1 1 1 1 1 1 1 1 1 1 1 1 1 1 1 1 1 1
symmnumber: 1
zpe: 909148.1 jmol-1
zpe.correction: 0.346276 hartree
zpe.thermalcorrener: 0.363099 hartree
zpe.thermalcorrenthalpy: 0.364043 hartree
zpe.thermalcorrgfe: 0.300758 hartree
zpe.sumelectzpe: -659.025349 hartree
zpe.sumelectthermal: -659.008527 hartree
zpe.sumelectthermalent: -659.007583 hartree
zpe.sumelectthermalfe: -659.070867 hartree
dipole: 0.4333 -1.2522 -1.4538
dipole: 1.9670
quadrupole: -92.4912 -91.6516 -96.4614
quadrupole: 0.3609 0.1115 -6.9933
quadrupole: 1.0435 1.8832 -2.9267 0.3609 0.1115 -6.9933
hfenergy: -659.3716256 hartree
pointgroup: C01 [X(C13H24O2)]
dipole: -0.168898 0.5493903 -0.5182269 debye
polarizability: 159.4601623|-3.5645234|141.751617|1.1437404|1.9908983|128.3486794 unknown
InChI: InChI=1S/C13H24O2/c1-3-4-6-9-13(15-12(2)14)10-7-5-8-11-13/h3-11H2,1-2H3
charge 0 multiplicity 1
39 atoms
O  -0.877776 -0.752726 -0.708966
O  -0.399965 -2.415374 0.879886
C  -0.765617 0.425398 0.26319
C  -1.086922 1.632909 -0.648474
C  -1.829096 0.282842 1.382402
C  0.66634 0.483083 0.852795
C  -2.541585 1.62734 -1.173817
C  -3.280021 0.273838 0.849464
C  -3.566927 1.519161 -0.022251
C  1.819618 0.539284 -0.173989
C  3.206421 0.457084 0.50314
C  4.378627 0.53164 -0.501602
C  -0.678789 -2.063582 -0.292447
C  5.762326 0.442297 0.177537
C  -0.842112 -3.02128 -1.459815
H  -0.380715 1.649726 -1.498065
H  -0.907722 2.551532 -0.053019
H  -1.697271 1.153011 2.058584
H  -1.618272 -0.624226 1.974665
H  0.806384 -0.392689 1.512786
H  0.711397 1.383509 1.499857
H  -2.669805 0.767646 -1.859394
H  -2.721919 2.545215 -1.766303
H  -3.983469 0.226461 1.702905
H  -3.447337 -0.640489 0.246109
H  -3.510799 2.429829 0.610825
H  -4.595519 1.474653 -0.429377
H  1.715457 -0.294821 -0.89642
H  1.764281 1.474954 -0.765825
H  3.306808 1.279415 1.242879
H  3.277217 -0.488756 1.079445
H  4.275102 -0.288036 -1.241908
H  4.307471 1.478511 -1.07544
H  5.903422 1.268247 0.900221
H  6.582062 0.497296 -0.562409
H  5.870549 -0.509033 0.731958
H  0.103287 -3.570413 -1.61485
H  -1.116685 -2.490162 -2.382474
H  -1.615545 -3.768892 -1.2122
