program: Gaussian 09
title: 000198599
version: EM64L-G09RevD.01
frameworkgroup: C1[X(C15H24N2O)]
method: RPBEPBE
basis: SDD
operation: Freq
keyword: #p
keyword: freq=noraman
keyword: PBEPBE/SDD
title: #p freq=noraman PBEPBE/SDD
converged: YES YES NO NO
title: Mulliken charges:
elementType: O N N C C C C C C C C C C C C C C C H H H H H H H H H H H H H H H H H H H H H H H H
charge: -0.292402 -0.069678 -0.148400 -0.076102 -0.222782 -0.090585 -0.010662 -0.555723 -0.480632 0.146468 -0.441270 -0.451502 -0.432063 -0.399856 -0.417694 -0.425960 -0.394947 -0.376239 0.205146 0.244561 0.255846 0.216866 0.218694 0.233183 0.187444 0.215413 0.205522 0.207499 0.212246 0.199614 0.217039 0.203421 0.206506 0.266427 0.216184 0.196469 0.219843 0.192571 0.200035 0.207568 0.200861 0.211073
chargesum: 0.00000
title: Mulliken charges with hydrogens summed into heavy atoms:
elementType: O N N C C C C C C C C C C C C C C C
charge: -0.292402 -0.069678 -0.148400 0.129044 0.021779 0.165261 0.206204 -0.103846 -0.077775 0.146468 -0.028248 -0.039642 -0.011603 0.073077 -0.005041 -0.013546 0.012655 0.035695
polarizability: 1.96387158e+02 6.62345058e+00 1.58771153e+02 2.91343791e+00 -4.30972871e-02 1.41488960e+02
1716.lowfreq: -19.2218 -4.1863 -0.0008 -0.0005 0.0000 4.4402 56.7344 66.7338 87.2800
frequency: 56.3904 66.5521 87.2706 108.0952 142.1489 177.1803 239.3628 254.1365 260.7226 269.7485 306.3650 337.9582 355.3573 367.3028 374.0318 408.2548 435.5929 442.2903 460.3197 496.3439 496.7507 542.2572 563.2655 607.7203 633.3997 679.0829 721.6216 730.9801 786.7087 813.7005 824.1104 835.6780 842.1383 849.9371 873.0348 892.1976 906.7662 916.3039 922.5781 949.5779 966.2469 979.8230 988.9062 1005.9967 1018.3452 1042.9734 1060.1219 1065.2152 1081.6490 1084.6987 1093.9128 1101.1157 1115.4627 1128.5435 1131.7132 1149.3606 1154.8324 1161.0164 1171.1933 1181.3755 1218.0624 1221.5210 1245.9667 1250.8454 1254.0758 1262.8979 1274.2904 1281.4923 1294.9675 1307.8018 1310.3214 1326.4743 1328.6581 1330.7481 1333.3802 1336.8926 1340.2355 1343.1264 1345.6710 1347.8804 1349.1633 1357.9867 1364.9780 1380.5964 1422.3273 1452.7567 1453.6563 1456.4947 1460.6013 1464.6923 1468.9558 1470.9646 1474.8746 1479.7085 1487.0401 1581.1295 2832.6413 2922.7994 2950.1403 2962.3228 2963.6229 2965.1523 2965.9563 2971.5779 2975.2531 2977.2196 2985.7305 2987.1365 2996.0376 3004.0623 3025.7731 3029.7734 3030.3824 3034.8097 3037.4651 3041.2627 3044.3103 3047.1216 3051.0667 3081.0598
redmass: 3.7839 3.3001 4.4140 3.8563 2.8722 2.6463 4.4061 2.6921 2.1887 2.1207 2.3889 2.8440 3.5201 2.1330 2.2363 3.3914 2.6400 3.2586 3.0321 2.8963 3.6962 1.8658 2.2366 5.4237 2.8360 3.7756 3.5651 5.0472 2.2303 1.9395 1.7997 2.5580 1.7997 2.4940 2.3820 1.9350 1.9969 1.7105 2.3895 1.9474 2.4167 2.2166 1.8641 2.0656 2.1457 1.8165 2.0766 2.1000 1.9149 1.5586 1.9462 1.7482 1.8167 1.9391 2.3227 1.3527 1.5043 1.9635 1.4304 1.9541 1.5051 1.5865 1.3743 1.3963 1.3715 1.3394 1.3825 1.3734 1.4809 1.4054 1.6019 1.6048 1.4446 1.2983 1.3885 1.4045 1.4201 1.4575 1.4513 1.4775 1.5239 1.4602 1.3176 1.3815 3.1159 1.0935 1.0917 1.0903 1.0877 1.0874 1.0897 1.0879 1.0923 1.0899 1.0926 8.4682 1.0707 1.0831 1.0697 1.0745 1.0628 1.0680 1.0626 1.0622 1.0643 1.0616 1.0616 1.0710 1.0803 1.0804 1.0969 1.0968 1.0979 1.1019 1.1019 1.0868 1.1036 1.1028 1.1029 1.0930
irintensity: 1.5285 0.5566 1.1316 2.3590 0.9364 0.3239 0.7010 3.3025 0.8731 0.8786 2.7173 1.9029 3.9147 0.9907 0.7995 4.1513 2.4281 4.6122 3.5465 6.7359 4.9121 5.8709 1.4190 2.7106 1.4047 1.1298 3.2551 5.6343 1.4613 1.6354 0.9697 4.2746 21.6750 3.3054 3.6739 1.8853 5.4600 3.7006 2.6866 5.8288 3.6898 2.0537 18.6161 6.5155 3.7717 11.5269 10.6297 4.9357 1.9519 10.1072 16.4689 5.3157 3.5095 4.1199 10.5458 17.0114 14.0295 31.6932 5.9690 17.5273 6.2966 11.4983 18.5964 30.7844 8.7676 32.6770 3.8516 7.8325 5.5156 7.1072 26.3451 6.6052 1.0229 2.8247 4.2699 1.0150 1.1152 15.7516 0.0859 2.6588 10.2394 3.4292 2.0358 3.5778 81.7985 7.1061 4.5500 10.7045 9.0036 12.7946 16.1466 4.4591 15.3216 16.5985 16.8085 268.4965 93.2036 23.2904 43.0682 17.3148 40.0269 36.9830 45.7744 21.7965 24.7992 38.5217 34.4683 8.8671 58.9552 59.3480 62.8209 61.8424 58.5021 7.7849 39.0575 22.6316 61.0569 97.1846 71.5265 9.1315
temp: 298.150 k
press: 1.00000 atm
elementType: 8 7 7 6 6 6 6 6 6 6 6 6 6 6 6 6 6 6 1 1 1 1 1 1 1 1 1 1 1 1 1 1 1 1 1 1 1 1 1 1 1 1
symmnumber: 1
zpe: 979021.7 jmol-1
zpe.correction: 0.372890 hartree
zpe.thermalcorrener: 0.387990 hartree
zpe.thermalcorrenthalpy: 0.388934 hartree
zpe.thermalcorrgfe: 0.331662 hartree
zpe.sumelectzpe: -769.331594 hartree
zpe.sumelectthermal: -769.316494 hartree
zpe.sumelectthermalent: -769.315550 hartree
zpe.sumelectthermalfe: -769.372821 hartree
dipole: 0.4069 -4.4772 0.8571
dipole: 4.5766
quadrupole: -99.4024 -120.1514 -106.7803
quadrupole: 3.9233 0.4542 1.7344
quadrupole: 9.3757 -11.3734 1.9978 3.9233 0.4542 1.7344
hfenergy: -769.7044834 hartree
pointgroup: C01 [X(C15H24N2O1)]
dipole: -0.1687172 -1.7465905 -0.4037585 debye
polarizability: 196.2515071|-6.983811|158.8359726|3.0858524|0.6139558|141.5597913 unknown
InChI: InChI=1S/C15H24N2O/c18-15-12-9-11(13-5-2-4-8-17(13)15)10-16-7-3-1-6-14(12)16/h11-14H,1-10H2
charge 0 multiplicity 1
42 atoms
O  0.805881 2.695995 0.34885
N  -1.474791 -0.490382 0.667716
N  1.614869 0.508917 0.271565
C  0.263044 -1.28509 -0.936269
C  -0.459132 1.085798 -0.983203
C  -1.710153 0.760616 -0.114176
C  1.474171 -0.947961 -0.019646
C  -0.051605 -0.102169 -1.877003
C  -1.015221 -1.640538 -0.13957
C  0.698274 1.494866 -0.064291
C  -3.036063 0.718966 -0.929205
C  2.805849 -1.474961 -0.622005
C  -2.616659 -0.78732 1.56839
C  2.741092 0.85397 1.169979
C  -4.229994 0.41479 0.011244
C  4.024681 -1.138466 0.267359
C  -3.980952 -0.877158 0.828684
C  4.080199 0.375433 0.574347
H  0.538334 -2.177066 -1.532997
H  -0.694884 1.981946 -1.584797
H  -1.808565 1.581278 0.627519
H  1.314888 -1.451731 0.96084
H  -0.865875 -0.376185 -2.574182
H  0.827841 0.165409 -2.492129
H  -1.778587 -2.013194 -0.871102
H  -0.80579 -2.477876 0.555487
H  -2.98213 -0.053663 -1.721772
H  -3.18673 1.692361 -1.43565
H  2.942593 -1.03169 -1.62925
H  2.722412 -2.57153 -0.753987
H  -2.671664 0.023763 2.323145
H  -2.401383 -1.727855 2.110783
H  2.574616 0.371543 2.15744
H  2.715537 1.946254 1.314689
H  -5.168176 0.331717 -0.570148
H  -4.363157 1.265709 0.711989
H  4.95942 -1.472535 -0.221784
H  3.944328 -1.699104 1.222259
H  -4.794728 -1.034524 1.563224
H  -3.983235 -1.754361 0.150856
H  4.898636 0.597551 1.28576
H  4.286008 0.942677 -0.35426
