program: Gaussian 09
title: 000198608
version: EM64L-G09RevD.01
frameworkgroup: C1[X(C19H23NO)]
method: RPBEPBE
basis: SDD
operation: Freq
keyword: #p
keyword: freq=noraman
keyword: PBEPBE/SDD
title: #p freq=noraman PBEPBE/SDD
converged: YES YES NO NO
title: Mulliken charges:
elementType: O N C C C C C C C C C C C C C C C C C C C H H H H H H H H H H H H H H H H H H H H H H H
charge: -0.482758 -0.064792 0.165978 -0.483716 -0.466954 -0.411159 -0.407888 0.414023 -0.481254 -0.398916 -0.407767 0.446705 -0.419298 -0.380344 0.439280 -0.448145 -0.376260 -0.811631 -0.220731 -0.228504 -0.245358 0.220210 0.230737 0.228553 0.216901 0.169705 0.250618 0.225262 0.167993 0.224893 0.191968 0.326691 0.222585 0.289424 0.225892 0.225440 0.231681 0.263423 0.223961 0.222603 0.233460 0.224884 0.224890 0.227717
chargesum: 0.00000
title: Mulliken charges with hydrogens summed into heavy atoms:
elementType: O N C C C C C C C C C C C C C C C C C C C
charge: -0.156067 -0.064792 0.165978 -0.032770 -0.021500 0.009164 -0.014633 0.414023 -0.064393 -0.176331 -0.118343 0.446705 -0.193406 -0.154904 0.439280 -0.216464 -0.112837 -0.131608 0.004153 -0.003615 -0.017641
polarizability: 2.87469694e+02 -5.18297909e+00 2.03218241e+02 -1.21252882e+01 1.26805429e+01 1.40479358e+02
1716.lowfreq: -29.8480 -12.7945 -6.0431 -0.0008 -0.0006 0.0004 3.0488 24.0471 28.0745
frequency: -29.7367 24.0261 28.0138 33.9719 52.3660 76.0045 86.3589 147.3434 168.6400 173.4601 188.8366 207.7552 246.0655 252.7250 303.7461 325.0627 337.4804 341.9437 357.8531 379.0263 405.8180 407.7790 425.1937 458.8596 466.2306 492.6884 533.7358 541.8215 592.1452 606.7718 617.9712 638.3297 687.6414 704.8826 729.9264 738.0247 773.4634 788.5876 791.4023 807.7186 823.7065 856.2615 859.2512 881.3270 909.9662 920.6635 935.3376 954.6543 982.2720 985.0549 986.2860 987.9106 989.9628 995.9237 1005.2372 1009.2376 1014.3922 1026.0568 1044.1097 1046.8193 1076.7834 1103.1609 1121.1946 1124.0399 1133.6160 1147.2478 1159.7403 1169.9504 1180.2231 1184.1168 1196.2061 1210.4881 1222.9537 1226.2088 1251.7591 1272.7021 1286.1791 1299.3898 1307.3793 1312.0198 1322.8101 1336.6948 1360.8644 1362.7334 1370.7923 1379.5388 1395.1058 1396.2125 1402.5191 1432.3218 1440.5546 1441.7983 1460.0293 1471.9902 1472.7643 1473.7549 1481.1800 1483.5207 1507.4896 1581.3425 1594.2047 1614.6070 1625.9905 2776.1591 2794.2073 2845.3791 2972.2969 2986.4977 3005.0384 3008.6601 3027.5886 3045.3570 3052.9483 3071.0474 3074.9156 3081.7763 3107.0999 3112.2708 3118.1302 3122.7951 3132.7895 3135.6506 3146.9323 3161.4083 3182.2487 3560.9641
redmass: 1.0124 4.2887 4.2564 3.7548 4.3609 3.4496 4.1280 1.1264 3.9643 3.4661 3.9224 3.1897 3.3083 2.9143 2.8342 3.5361 2.8580 2.8185 2.8781 2.0875 2.8446 2.8855 2.7763 2.9352 3.2486 3.5504 4.2811 2.7587 4.5120 3.3322 5.8993 6.9677 3.0808 2.1837 3.0650 1.6376 2.7852 3.2536 1.8853 3.5932 1.5019 1.2547 1.2496 3.3355 1.6423 2.3643 1.8578 1.4187 1.3946 1.3930 1.3970 2.4310 4.9911 1.4341 1.6060 1.7792 2.8151 2.1067 2.2758 1.5599 1.6135 2.2109 1.9483 2.8535 1.6924 1.7907 2.0550 1.0615 1.1122 1.2159 1.1420 2.4848 2.8603 1.3573 1.3658 1.5218 1.5967 1.4725 1.3041 1.3681 1.4168 1.3284 1.4824 2.1159 3.2729 2.9974 1.9984 1.2268 3.2553 1.0901 1.9686 1.1412 1.1155 1.0851 1.0587 1.1047 1.3830 1.5262 2.7013 6.2169 6.1683 6.1457 6.4545 1.0718 1.0708 1.0703 1.0386 1.0862 1.0610 1.0614 1.0838 1.0860 1.0949 1.1026 1.1025 1.0997 1.0866 1.0870 1.0903 1.0862 1.0962 1.0914 1.0955 1.1014 1.0931 1.0650
irintensity: 0.5048 0.0661 0.2741 0.2793 0.2670 0.4532 0.1471 100.4041 3.8214 2.0233 7.2305 1.4051 3.9952 3.4787 2.2790 2.9218 2.7416 2.5749 1.1088 3.0210 0.3118 0.0281 0.7360 5.5469 6.8342 7.3670 11.8147 18.2054 2.2409 2.7695 0.1064 0.0919 0.1104 34.0440 0.9236 57.1364 21.5395 6.0839 3.8884 0.8745 45.9167 5.5130 0.4004 47.4635 5.2372 4.3804 0.1544 1.7836 1.5425 2.4052 1.0395 39.2235 5.9162 1.4234 2.5158 10.1260 3.1862 12.5117 5.3611 18.5815 18.7792 43.0196 48.8433 2.3028 21.9429 47.1889 6.5301 0.4955 2.6104 15.2975 7.9881 3.9794 0.6525 6.4024 0.9254 17.9666 0.3219 12.7705 10.3706 18.1812 1.1695 21.4504 22.1502 9.1604 20.4011 4.6463 2.2596 9.1869 4.9461 6.8167 7.5648 14.7135 8.0602 15.1756 12.4827 5.0593 13.7644 13.9246 39.4176 0.0584 0.9319 6.8968 0.5961 62.3656 140.4946 122.8122 45.3210 20.1025 11.6328 23.6591 45.6744 18.8468 24.9896 10.2444 28.4122 19.5964 20.7204 8.6043 32.2798 0.1677 19.8264 18.0081 34.1832 26.9967 2.6002 0.7734
temp: 298.150 k
press: 1.00000 atm
elementType: 8 7 6 6 6 6 6 6 6 6 6 6 6 6 6 6 6 6 6 6 6 1 1 1 1 1 1 1 1 1 1 1 1 1 1 1 1 1 1 1 1 1 1 1
symmnumber: 1
zpe: 975377.8 jmol-1
zpe.correction: 0.371502 hartree
zpe.thermalcorrener: 0.390311 hartree
zpe.thermalcorrenthalpy: 0.391255 hartree
zpe.thermalcorrgfe: 0.322984 hartree
zpe.sumelectzpe: -866.242306 hartree
zpe.sumelectthermal: -866.223497 hartree
zpe.sumelectthermalent: -866.222553 hartree
zpe.sumelectthermalfe: -866.290824 hartree
dipole: 1.4915 0.0172 0.4672
dipole: 1.5631
quadrupole: -118.8557 -118.0144 -127.5267
quadrupole: -7.1258 -4.4895 1.2697
quadrupole: 2.6099 3.4512 -6.0611 -7.1258 -4.4895 1.2697
hfenergy: -866.613808 hartree
pointgroup: C01 [X(C19H23N1O1)]
dipole: -0.5924482 -0.0497641 -0.1571785 debye
polarizability: 286.3519203|1.2251883|191.3164821|-17.6794711|-27.8463209|153.4988912 unknown
InChI: InChI=1S/C19H23NO/c1-16-7-9-18(10-8-16)19(21)11-13-20(14-12-19)15-17-5-3-2-4-6-17/h2-10,21H,11-15H2,1H3
charge 0 multiplicity 1
44 atoms
O  1.642795 -1.922768 1.354038
N  -1.505262 -0.980345 -0.247837
C  1.407755 -0.857721 0.346189
C  0.382129 0.167391 0.909924
C  0.829613 -1.497558 -0.95024
C  -1.030405 -0.435206 1.045293
C  -0.598249 -2.041067 -0.744433
C  2.771261 -0.209455 0.085453
C  -2.920459 -1.417574 -0.199658
C  2.892052 0.858817 -0.839896
C  3.937977 -0.653826 0.752606
C  -3.903775 -0.259674 -0.049683
C  4.142749 1.462424 -1.089899
C  5.18777 -0.046355 0.498393
C  5.316845 1.018054 -0.428886
C  -5.075933 -0.407622 0.731506
C  -3.685091 0.964316 -0.731557
C  6.668972 1.645037 -0.72497
C  -6.019885 0.641615 0.823723
C  -4.622866 2.015868 -0.637191
C  -5.796376 1.857689 0.138361
H  0.328424 1.039733 0.234304
H  0.740232 0.521144 1.894204
H  1.504049 -2.312429 -1.271145
H  0.805608 -0.73729 -1.75176
H  -1.038816 -1.232442 1.842073
H  -1.734447 0.345391 1.382803
H  -0.989023 -2.421861 -1.706307
H  -0.572551 -2.919714 -0.041176
H  -3.127701 -1.945552 -1.152809
H  -3.101832 -2.161665 0.618725
H  0.76772 -2.315081 1.601693
H  2.007817 1.233061 -1.371289
H  3.848928 -1.47306 1.469973
H  4.209014 2.289729 -1.807533
H  6.07811 -0.405768 1.029896
H  -5.251251 -1.34678 1.271972
H  -2.767751 1.076093 -1.320368
H  7.33605 1.603717 0.154404
H  6.568832 2.702515 -1.027915
H  7.182406 1.114445 -1.55084
H  -6.922026 0.512529 1.432637
H  -4.441492 2.957843 -1.167803
H  -6.524417 2.673601 0.210922
