program: Gaussian 09
title: 000198593
version: EM64L-G09RevD.01
frameworkgroup: C1[X(C12H12O5)]
method: RPBEPBE
basis: SDD
operation: Freq
keyword: #pfreq=noraman
keyword: PBEPBE/SDD
title: #p freq=noraman PBEPBE/SDD
converged: YES YES NO NO
title: Mulliken charges:
elementType: O O O O O C C C C C C C C C C C C H H H H H H H H H H H H
charge: -0.239304 -0.220976 -0.245691 -0.418022 -0.246644 0.349793 0.221060 0.210382 -0.493306 -0.366995 -0.349836 0.091423 -0.209631 -0.536685 -0.537154 -0.268554 0.154706 0.297631 0.226405 0.247919 0.246591 0.228974 0.228961 0.247736 0.226876 0.226875 0.253776 0.293167 0.380522
chargesum: 0.00000
title: Mulliken charges with hydrogens summed into heavy atoms:
elementType: O O O O O C C C C C C C C C C C C
charge: -0.239304 -0.220976 -0.245691 -0.037500 -0.246644 0.349793 0.221060 0.210382 -0.195675 -0.140590 -0.101917 0.091423 0.036960 0.168986 0.170372 0.024614 0.154706
polarizability: 3.12533589e+02 -1.79571585e+01 1.67618096e+02 -2.99433439e-02 5.91523551e-02 6.85426150e+01
1716.lowfreq: -4.3802 0.0004 0.0007 0.0010 1.9137 5.3487 27.8064 32.9592 59.6806
frequency: 27.8052 32.9545 59.6760 75.3104 98.3320 135.2402 146.6112 149.5461 159.1609 174.8613 183.5538 232.3947 236.1233 260.2243 260.7585 301.0775 345.2072 366.4478 420.7251 467.9122 491.6038 514.7160 550.8213 582.7562 589.4264 594.0134 619.5913 664.2585 730.8769 731.2048 756.0401 763.8734 806.2422 875.3441 906.4178 921.6260 927.6057 938.6481 974.3122 984.5827 999.4067 1038.4254 1064.8812 1111.6334 1113.0808 1144.6768 1146.6377 1160.9312 1179.4256 1216.0610 1237.3312 1262.5661 1286.9708 1312.0892 1327.2923 1392.5546 1427.3313 1436.0816 1446.7603 1467.1639 1469.3868 1470.3283 1470.6067 1502.0085 1522.4203 1575.5907 1601.9161 1629.0887 1650.1494 2967.4939 2969.0652 3058.7036 3061.5384 3132.9994 3135.9543 3149.6880 3159.9233 3164.4364 3167.8624 3178.6060 3520.2907
redmass: 7.0221 6.9226 6.5655 4.5163 3.2147 3.6947 4.9702 4.4914 3.2540 3.9513 2.1088 7.7087 1.1349 1.4415 4.6921 8.0275 4.1865 3.9566 6.0775 3.4293 5.3298 6.4151 2.5776 5.7946 4.2427 1.8447 6.0865 2.2817 5.5199 3.9605 6.9990 3.5647 1.6998 6.4853 1.6788 1.6020 1.6736 3.7533 8.5003 7.0681 1.0893 2.6487 1.9909 1.2594 1.2617 1.4894 2.0552 1.4102 1.6334 1.5139 1.8551 2.8629 1.8067 1.8795 2.3848 3.7059 2.5846 1.2014 1.6449 1.0486 1.0906 1.0499 1.0691 3.1604 7.3271 7.3625 6.3712 8.6265 6.2299 1.0326 1.0326 1.1042 1.1043 1.1002 1.1000 1.0909 1.0885 1.0904 1.0914 1.0946 1.0641
irintensity: 0.2778 1.5576 0.5566 0.0398 16.1598 4.1106 7.7274 0.0015 0.0663 1.8382 0.2323 3.6811 0.0049 0.1013 2.1201 2.5335 0.4149 4.4426 17.0084 0.4087 43.1057 39.7491 22.1105 48.5821 7.9468 88.3707 12.3330 41.0576 28.4852 45.8736 6.3783 16.9560 22.2174 0.9335 17.0263 10.6735 1.4413 1.5485 31.2300 65.8491 55.3280 216.4657 296.3728 0.0757 0.1821 72.6670 114.8714 23.5426 38.3536 22.2378 27.3381 381.8725 45.7170 214.0121 296.6108 91.9489 58.3558 28.5460 39.1248 13.2755 98.6144 17.1865 35.4362 253.3521 140.4985 61.7044 144.8211 210.2017 4.6967 69.2921 54.3249 36.5706 44.7280 21.7880 21.4297 3.3977 5.9813 8.2560 2.0079 9.0334 58.9320
temp: 298.150 k
press: 1.00000 atm
elementType: 8 8 8 8 8 6 6 6 6 6 6 6 6 6 6 6 6 1 1 1 1 1 1 1 1 1 1 1 1
symmnumber: 1
zpe: 570542.4 jmol-1
zpe.correction: 0.217308 hartree
zpe.thermalcorrener: 0.234214 hartree
zpe.thermalcorrenthalpy: 0.235158 hartree
zpe.thermalcorrgfe: 0.171247 hartree
zpe.sumelectzpe: -839.307382 hartree
zpe.sumelectthermal: -839.290476 hartree
zpe.sumelectthermalent: -839.289532 hartree
zpe.sumelectthermalfe: -839.353443 hartree
dipole: 2.6974 -2.1973 0.0024
dipole: 3.4790
quadrupole: -86.8407 -89.1221 -100.7120
quadrupole: -4.1790 -0.0003 -0.0260
quadrupole: 5.3842 3.1028 -8.4871 -4.1790 -0.0003 -0.0260
hfenergy: -839.5246901 hartree
pointgroup: C01 [X(C12H12O5)]
dipole: 1.0481275 0.8796272 0.0344347 debye
polarizability: 311.7730553|20.0062827|168.1606477|7.2210292|1.19123|68.7605974 unknown
InChI: InChI=1S/C12H12O5/c1-16-10-5-3-8(7-11(10)17-2)9(13)4-6-12(14)15/h3-7,14H,1-2H3
charge 0 multiplicity 1
29 atoms
O  3.680995 -1.326936 0.077971
O  4.069548 1.284752 0.101692
O  -1.39407 -2.059134 -0.077131
O  -6.095844 -0.321679 -0.204933
O  -4.935444 1.696518 -0.15392
C  0.093509 -0.164055 -0.020263
C  2.527317 -0.546022 0.048206
C  2.743285 0.878333 0.061897
C  1.216949 -1.041775 0.007317
C  0.31683 1.236256 -0.005728
C  1.629758 1.749424 0.034836
C  -1.258562 -0.7890 -0.06388
C  -2.469109 0.091027 -0.092532
C  3.498763 -2.783616 0.064738
C  4.343214 2.727743 0.115731
C  -3.725392 -0.436364 -0.13544
C  -4.917642 0.44008 -0.163655
H  1.005849 -2.115126 -0.005272
H  -0.515454 1.944653 -0.02536
H  1.780933 2.832327 0.04505
H  -2.363943 1.181072 -0.079321
H  2.982595 -3.113215 -0.85713
H  2.928796 -3.122887 0.950752
H  4.517369 -3.195994 0.092864
H  3.906799 3.207558 1.012329
H  3.956531 3.215634 -0.799147
H  5.439092 2.805032 0.146264
H  -3.876365 -1.520477 -0.1501
H  -6.880204 0.291272 -0.223337
