program: Gaussian 09
title: 000198592
version: EM64L-G09RevD.01
frameworkgroup: C1[X(C8H10O4)]
method: RPBEPBE
basis: SDD
operation: Freq
keyword: #pfreq=noraman
keyword: PBEPBE/SDD
title: #p freq=noraman PBEPBE/SDD
converged: YES YES NO NO
title: Mulliken charges:
elementType: O O O O C C C C C C C C H H H H H H H H H H
charge: -0.247246 -0.208344 -0.420972 -0.204838 0.311256 -0.538895 -0.707623 -0.710716 0.195014 0.221565 -0.388315 0.117177 0.248746 0.249755 0.241047 0.223893 0.241582 0.241974 0.212431 0.233022 0.295154 0.394332
chargesum: 0.00000
title: Mulliken charges with hydrogens summed into heavy atoms:
elementType: O O O O C C C C C C C C
charge: -0.247246 -0.208344 -0.026640 -0.204838 0.311256 -0.040394 -0.001100 -0.023289 0.195014 0.221565 -0.093162 0.117177
polarizability: 1.17433151e+02 -1.00688460e+01 1.18569265e+02 1.62652721e+00 2.43175121e+00 6.45211167e+01
1716.lowfreq: -12.3050 -3.9297 -0.0008 0.0001 0.0006 7.5892 40.9495 90.3762 107.0808
frequency: 40.9260 90.3717 107.0723 153.1529 162.7106 189.0645 229.2442 266.2137 305.1013 313.7308 384.4513 392.3089 429.3742 437.9892 478.9527 502.7754 536.2431 585.6476 609.9642 614.6535 737.6134 757.1306 820.4262 852.5592 869.1638 891.0584 928.1735 934.2849 972.7397 1010.5406 1033.0259 1084.2701 1119.7648 1173.5371 1224.7752 1243.1894 1269.4159 1296.1186 1317.2057 1362.4710 1383.8400 1399.2976 1428.3251 1455.2253 1464.9069 1472.7324 1487.2446 1573.6078 1590.2771 1655.4282 2988.6698 2994.8305 2998.7893 3077.6048 3089.7520 3098.9751 3103.3349 3107.4759 3201.5074 3532.3882
redmass: 10.7506 3.7307 4.5450 4.0495 5.3158 1.0655 1.1745 2.2973 4.1957 2.6498 4.1506 4.4365 3.1326 6.3235 3.7052 3.4130 4.0967 1.8450 4.3593 1.9180 6.7921 6.3169 2.6911 2.8060 1.8954 2.3896 2.3211 1.6094 1.8595 1.4345 3.7783 1.7790 1.6216 1.8501 1.7702 2.5426 2.3862 2.1217 2.0905 4.8151 1.2449 1.2067 1.0835 1.0544 1.0490 1.0650 1.0530 10.7366 8.5461 9.5004 1.0635 1.0360 1.0367 1.0962 1.0990 1.0996 1.1009 1.1002 1.0929 1.0644
irintensity: 2.0190 4.2850 1.7345 2.3966 4.7628 0.0388 0.6556 0.7157 5.2862 1.8417 15.1045 0.5258 15.6067 0.8930 1.9335 6.2325 0.8293 86.0335 27.7358 72.6614 23.6363 14.0278 4.9636 7.0585 7.5073 16.5792 10.6210 2.8164 11.5179 4.7486 388.7786 31.0348 30.0613 26.7782 4.5263 87.9994 26.3961 86.0237 39.6330 42.8742 33.4028 20.6911 9.1856 8.0141 3.6185 7.2889 13.8001 34.6430 341.5455 201.4669 9.7113 9.8655 11.9119 3.9790 14.2838 18.2699 11.4305 25.4271 2.8186 53.6659
temp: 298.150 k
press: 1.00000 atm
elementType: 8 8 8 8 6 6 6 6 6 6 6 6 1 1 1 1 1 1 1 1 1 1
symmnumber: 1
zpe: 441611.2 jmol-1
zpe.correction: 0.168201 hartree
zpe.thermalcorrener: 0.180173 hartree
zpe.thermalcorrenthalpy: 0.181117 hartree
zpe.thermalcorrgfe: 0.130225 hartree
zpe.sumelectzpe: -610.826553 hartree
zpe.sumelectthermal: -610.814581 hartree
zpe.sumelectthermalent: -610.813637 hartree
zpe.sumelectthermalfe: -610.864529 hartree
dipole: -0.5053 -1.8558 0.2150
dipole: 1.9354
quadrupole: -58.9204 -87.0880 -67.8352
quadrupole: 14.3294 1.2314 -1.2403
quadrupole: 12.3608 -15.8068 3.4460 14.3294 1.2314 -1.2403
hfenergy: -610.9947539 hartree
pointgroup: C01 [X(C8H10O4)]
dipole: -0.1954012 -0.7084866 0.1991064 debye
dipolederiv: -0.8496273 -0.7356642 0.1695186 -0.2215965 -0.9035483 0.1293352 0.0740846 -0.0558065 -0.3089168 -0.6258125 0.2746104 -0.0512552 0.1946355 -0.9869404 0.0528345 -0.0508765 0.0289349 -0.3337618 -0.9085232 -0.4097958 0.049947 -0.5450292 -0.7005138 0.026093 0.0591833 0.0148455 -0.4108088 -0.7261225 0.3120321 -0.0225798 0.0611234 -0.8992886 0.0586403 0.0025665 0.0467885 -0.304986 0.731229 0.4717495 -0.1619114 0.0914217 0.3231867 -0.0063319 -0.1277982 -0.0137644 0.45931 -0.1908327 -0.2267595 -0.0268846 -0.1507851 -0.2948684 -0.0268424 -0.0752856 -0.0099123 0.0058637 -0.0525702 -0.1222864 0.0172487 0.0006696 0.0065992 -0.0268703 0.043998 -0.0384247 -0.1827489 -0.0017197 -0.0734461 0.0004837 -0.093559 -0.0804007 -0.0411643 -0.014696 -0.0324215 0.0022665 1.1126436 -0.4971389 0.1817463 -0.046174 1.0307709 0.0130508 0.1631873 0.0066202 0.1748665 0.0949372 0.5282409 -0.0720508 0.4731195 0.9346384 -0.1810637 -0.0225694 0.0198757 0.1117221 -0.6138114 0.5156202 -0.0983728 -0.0374151 -0.4291057 0.0566484 -0.046616 0.0123136 -0.214192 1.6142258 -0.2100498 0.010479 0.1455824 1.3991892 -0.1103045 -0.0330573 -0.0586463 0.2409369 -0.0685299 0.00613 0.0377278 0.0382654 0.0903311 -0.0028774 0.0677283 -0.0103677 0.1003676 0.0971082 0.0090485 0.0184735 -0.0260362 0.0502573 -0.0314563 -0.0044292 0.0018883 -0.0924854 0.0513644 -0.0669222 -0.059114 -0.0844463 -0.0509698 -0.0743909 -0.0407651 -0.0442262 0.0680384 -0.1144278 -0.0001814 0.0551402 0.0217819 0.112857 -0.0025408 0.0269168 0.0351588 0.0721952 0.0856387 0.0796674 -0.0441152 0.046065 -0.0359785 0.1026951 -0.0137964 0.0450748 0.0298563 0.0801083 0.085713 -0.0512954 0.0130455 -0.0454335 0.0639568 -0.0469017 0.0932067 0.0385268 -0.1184659 -0.0226696 0.0370353 0.0424198 0.0737035 -0.0139574 0.0482979 -0.012485 0.0949219 0.0988163 0.0143304 0.0382062 -0.0140074 0.0788872 -0.0061725 0.0162946 -0.040761 -0.1309793 0.0575346 -0.0170999 -0.017333 -0.0678708 0.081919 0.0028158 -0.0018808 -0.0046733 0.1797 0.246837 0.0848714 -0.0110941 0.1587899 0.2447083 0.0179025 -0.0235852 0.016782 0.4003072 unknown
polarizability: 117.506509|-9.8690857|118.1329812|1.58446|-5.4374964|64.8840421 unknown
InChI: InChI=1S/C8H10O4/c1-8(2)4-5(9)3-6(12-8)7(10)11/h3,10H,4H2,1-2H3
charge 0 multiplicity 1
22 atoms
O  0.05127 -1.269999 -0.118077
O  -1.466384 2.623222 -0.435771
O  3.137955 0.594848 -0.189731
O  2.76788 -1.694351 0.019511
C  -1.440148 -1.029383 0.150724
C  -1.897463 0.214772 -0.643495
C  -1.588905 -0.84583 1.673702
C  -2.102606 -2.318421 -0.344669
C  -1.005724 1.441996 -0.402962
C  0.863159 -0.15861 -0.147212
C  0.420177 1.145273 -0.221929
C  2.316108 -0.53652 -0.093328
H  -2.938296 0.471234 -0.380992
H  -1.875114 -0.006745 -1.729823
H  -1.05888 0.051822 2.036347
H  -2.657354 -0.73448 1.932044
H  -1.190816 -1.727778 2.20254
H  -1.695194 -3.190525 0.194121
H  -3.1923 -2.274651 -0.170302
H  -1.92329 -2.462149 -1.423698
H  1.137991 1.966721 -0.193273
H  4.089438 0.308053 -0.144027
