program: Gaussian 09
title: 000017138
version: EM64L-G09RevD.01
frameworkgroup: C1[X(C21H25N)]
method: RPBEPBE
basis: SDD
operation: Freq
keyword: #pfreq=noraman
keyword: PBEPBE/SDD
title: #p freq=noraman PBEPBE/SDD
converged: YES YES NO NO
title: Mulliken charges:
elementType: N C C C C C C C C C C C C C C C C C C C C C H H H H H H H H H H H H H H H H H H H H H H H H H
charge: -0.113630 -0.051051 -0.081319 -0.206185 -0.536900 -0.521584 -0.434428 -0.427198 -0.437775 -0.509120 0.556059 0.454951 -0.398126 -0.482971 -0.374517 -0.455628 -0.251357 -0.220789 -0.248778 -0.229345 -0.220978 -0.246304 0.227959 0.201425 0.218552 0.218971 0.219697 0.224180 0.217543 0.208486 0.192847 0.190782 0.205521 0.203834 0.209171 0.225233 0.186581 0.222613 0.229769 0.261059 0.229170 0.221524 0.222896 0.226715 0.223270 0.223207 0.225965
chargesum: 0.00000
title: Mulliken charges with hydrogens summed into heavy atoms:
elementType: N C C C C C C C C C C C C C C C C C C C C C
charge: -0.113630 0.176908 0.120106 0.012367 -0.098232 -0.079860 -0.033095 -0.030894 -0.024770 -0.097306 0.556059 0.454951 -0.175513 -0.253202 -0.113458 -0.226458 -0.029833 0.002107 -0.022063 -0.006075 0.002229 -0.020339
polarizability: 2.78479253e+02 -5.89975694e+00 2.32899282e+02 8.32372750e+00 -3.97549181e+00 1.49065735e+02
1716.lowfreq: -10.7157 -6.3366 -0.0006 0.0005 0.0007 9.2522 22.1990 31.2327 33.4893
frequency: 21.9565 30.9975 33.3967 50.1711 78.3100 87.0866 133.6750 148.2307 195.7202 203.4557 236.6527 269.1403 269.9669 290.9689 320.6178 360.0881 389.8663 404.6374 406.7620 412.7947 443.6323 463.3736 489.1869 526.2955 532.0885 587.1541 602.4029 616.8645 617.4874 656.5067 699.3086 706.3530 708.5443 728.5163 753.0314 756.4835 792.0979 811.2657 824.1753 827.8221 831.4022 850.7328 858.7350 869.9235 891.4268 912.2306 917.1325 933.8311 961.9252 971.8656 972.8840 980.1390 983.2105 989.5550 990.0275 992.4754 998.7331 1001.2204 1024.9808 1027.9355 1064.1342 1075.3883 1077.1182 1084.6760 1095.8148 1096.7029 1119.2043 1120.9867 1168.8587 1169.1469 1170.9811 1178.4093 1187.9053 1196.6788 1203.1401 1211.6602 1213.6019 1234.1631 1255.9160 1260.6797 1268.2277 1282.7304 1295.5143 1300.2987 1308.9704 1322.5447 1332.4501 1337.4168 1345.4449 1348.4439 1351.3981 1356.6985 1361.0490 1374.5048 1386.5833 1389.8652 1439.3257 1441.0861 1446.0616 1453.7746 1456.9812 1465.6409 1473.5690 1481.6687 1483.4288 1495.9927 1591.7131 1593.9910 1612.0982 1613.5055 2852.9721 2964.3783 2973.1785 2975.0288 2975.7353 2977.1066 2987.5523 2996.9687 3004.5320 3007.9764 3025.4050 3025.9371 3036.7133 3038.1333 3060.2850 3109.4070 3109.5935 3111.5035 3121.2058 3128.8269 3134.1211 3140.0092 3145.6276 3160.0042 3160.1483
redmass: 5.0863 3.8257 3.7900 3.7932 4.0002 3.9888 2.3990 4.0780 4.0785 4.3840 2.7246 2.6254 3.4923 2.9078 2.2936 2.1290 2.1403 2.8117 2.8520 3.1907 3.3298 2.7677 3.6686 3.1160 2.7573 3.4450 4.1373 6.3777 6.1484 5.0391 3.6066 1.6805 1.9288 2.4521 2.1553 2.0027 2.8775 2.5508 3.0326 1.4994 2.9438 1.2481 1.2485 2.8842 1.6490 1.4405 1.4009 2.2766 2.1079 1.8847 1.4218 1.5256 1.6043 5.8942 5.9778 1.3147 1.7734 2.1812 2.1491 2.1157 2.2332 1.6456 1.6480 1.5452 1.7154 1.5781 1.9473 3.5260 1.0798 1.3161 1.0551 1.1143 1.1120 1.2998 1.8604 2.4036 2.7307 1.2464 1.5762 1.3677 1.3943 1.3164 1.4932 1.5437 1.3080 1.2505 1.3768 1.3501 1.2911 1.4167 1.4220 1.4820 1.4877 1.8584 4.2915 3.2051 2.0715 2.0483 1.0875 1.1005 1.1027 1.1154 1.2720 2.1408 1.7740 1.0976 5.8328 6.1618 6.1587 6.1513 1.0700 1.0705 1.0616 1.0769 1.0664 1.0641 1.0714 1.0679 1.0871 1.0810 1.0994 1.1012 1.1022 1.0984 1.0990 1.0871 1.0867 1.0870 1.0860 1.0901 1.0913 1.0955 1.0954 1.1013 1.1013
irintensity: 0.0328 0.0871 0.0458 0.2475 0.0617 0.1405 0.1371 1.3927 1.5089 0.5173 0.1933 0.5419 0.8156 0.2036 2.4394 0.4165 2.4566 0.0017 0.4493 0.7516 4.8407 9.6078 7.4226 13.5549 7.6150 1.0587 3.2615 0.4008 0.0770 0.3392 6.6927 43.0222 47.8552 15.1192 52.4249 19.3786 20.0479 4.1686 0.0550 0.3710 0.6492 0.0518 0.4883 3.5400 3.0957 3.1963 3.0781 14.2730 0.8485 4.4153 0.4824 7.2049 8.1520 1.0087 0.4396 0.0734 21.1650 17.6719 11.2018 5.9946 3.9872 26.1700 6.2706 0.2883 8.9262 1.7133 32.3431 4.2905 0.5116 0.5206 0.0172 2.5152 0.2532 0.2384 9.5590 3.0829 1.9521 13.3502 11.1026 7.9799 3.5477 7.1243 7.2375 18.6793 6.0254 3.5452 1.8872 1.7849 0.0157 7.6218 11.2267 4.5779 1.8659 6.0683 1.1027 0.9910 11.0052 13.1226 1.7272 15.4745 17.7956 1.6579 6.1049 27.7100 13.2368 9.8364 1.5003 0.7348 14.0233 6.5255 73.3369 7.1125 10.7427 9.7914 38.2007 8.1662 117.8027 85.9636 12.2286 33.1017 19.9323 14.5970 20.2991 63.5101 111.1633 20.3016 6.1483 9.4422 0.2205 9.5968 19.0913 45.8269 32.3219 44.2438 17.2121
temp: 298.150 k
press: 1.00000 atm
elementType: 7 6 6 6 6 6 6 6 6 6 6 6 6 6 6 6 6 6 6 6 6 6 1 1 1 1 1 1 1 1 1 1 1 1 1 1 1 1 1 1 1 1 1 1 1 1 1
symmnumber: 1
zpe: 1066267.1 jmol-1
zpe.correction: 0.406120 hartree
zpe.thermalcorrener: 0.424623 hartree
zpe.thermalcorrenthalpy: 0.425567 hartree
zpe.thermalcorrgfe: 0.357873 hartree
zpe.sumelectzpe: -868.367051 hartree
zpe.sumelectthermal: -868.348548 hartree
zpe.sumelectthermalent: -868.347604 hartree
zpe.sumelectthermalfe: -868.415298 hartree
dipole: 0.5495 0.2454 0.0273
dipole: 0.6024
quadrupole: -128.8135 -123.3081 -134.5833
quadrupole: 0.7955 1.1921 -1.6595
quadrupole: 0.0881 5.5935 -5.6817 0.7955 1.1921 -1.6595
hfenergy: -868.7731711 hartree
pointgroup: C01 [X(C21H25N1)]
dipole: 0.2118329 0.1062797 0.0010315 debye
polarizability: 279.057167|-3.3770859|231.5148356|7.5284852|-9.5726639|149.8722676 unknown
InChI: InChI=1S/C21H25N/c1-3-8-17(9-4-1)16-22-20-12-7-13-21(22)15-19(14-20)18-10-5-2-6-11-18/h1-6,8-11,19-21H,7,12-16H2
charge 0 multiplicity 1
47 atoms
N  -1.130344 0.968599 0.467732
C  -0.701876 0.849685 -0.95976
C  -0.132273 1.771921 1.23189
C  1.81199 0.766493 -0.209112
C  0.684206 0.144234 -1.092362
C  1.279408 1.106577 1.219218
C  -0.792297 2.259877 -1.600509
C  -0.182701 3.230058 0.699856
C  0.003969 3.348199 -0.835084
C  -1.539042 -0.300809 1.108483
C  3.046388 -0.13582 -0.147361
C  -2.849381 -0.848208 0.542449
C  2.981315 -1.442047 0.408821
C  4.295564 0.315217 -0.644523
C  -3.91677 0.028587 0.221028
C  -3.034704 -2.241634 0.368984
C  4.125159 -2.267175 0.465212
C  5.445517 -0.5063 -0.591414
C  5.364717 -1.802709 -0.035277
C  -5.145245 -0.47881 -0.25507
C  -4.264923 -2.754272 -0.105322
C  -5.32544 -1.873644 -0.418186
H  -1.44778 0.21031 -1.470414
H  -0.472509 1.799333 2.287406
H  2.133898 1.710353 -0.685131
H  1.00488 0.144762 -2.15257
H  0.558868 -0.921022 -0.813227
H  1.222519 0.170607 1.8107
H  2.010984 1.75582 1.739281
H  -1.864022 2.538446 -1.607124
H  -0.458773 2.213439 -2.655881
H  0.573332 3.845315 1.226603
H  -1.178846 3.632154 0.968483
H  1.076111 3.290137 -1.095795
H  -0.331616 4.349973 -1.167358
H  -1.677581 -0.080328 2.187494
H  -0.766806 -1.108543 1.056525
H  2.028953 -1.820427 0.801953
H  4.366696 1.321132 -1.077954
H  -3.754287 1.10588 0.338903
H  -2.212231 -2.929824 0.603836
H  4.053022 -3.27183 0.898034
H  6.400206 -0.135854 -0.982475
H  6.253144 -2.44283 0.00818
H  -5.96262 0.209854 -0.499269
H  -4.39263 -3.83514 -0.23581
H  -6.278751 -2.267838 -0.788483
