program: Gaussian 09
title: 000198609
version: EM64L-G09RevD.01
frameworkgroup: C1[X(C14H15O2PS2)]
method: RPBEPBE
basis: SDD
operation: Freq
keyword: #p
keyword: freq=noraman
keyword: PBEPBE/SDD
title: #p freq=noraman PBEPBE/SDD
converged: YES YES NO NO
title: Mulliken charges:
elementType: S S P O O C C C C C C C C C C C C C C H H H H H H H H H H H H H H H
charge: -0.215800 0.203746 0.655347 -0.496295 -0.478630 0.000916 0.355012 -0.265306 -0.309211 -0.350401 -0.353605 -0.215173 -0.208267 -0.216289 -0.220718 -0.195474 -0.128508 -0.472968 -0.864947 0.277905 0.278875 0.248931 0.260490 0.237424 0.237920 0.242089 0.239177 0.235817 0.246636 0.237338 0.239916 0.267108 0.265060 0.261885
chargesum: 0.00000
title: Mulliken charges with hydrogens summed into heavy atoms:
elementType: S S P O O C C C C C C C C C C C C C C
charge: -0.215800 0.203746 0.655347 -0.496295 -0.478630 0.000916 0.355012 0.012600 -0.030336 -0.101470 -0.093115 0.022251 0.029653 -0.216289 0.015099 0.046614 0.110669 0.250922 -0.070895
polarizability: 2.78076183e+02 1.20347488e+01 2.19472074e+02 -2.77983104e+01 -1.57428153e+01 1.72643120e+02
1716.lowfreq: -13.4846 -7.0002 -0.0028 -0.0024 -0.0022 7.1308 10.2645 19.6923 24.3976
frequency: 7.3339 19.2315 24.2255 37.1588 53.5631 61.8780 81.2278 99.6049 111.1142 119.6431 150.9714 153.2799 199.4252 224.3813 226.1874 257.6296 282.2445 292.0176 307.1585 341.5361 391.8162 396.1999 408.5455 413.0726 426.8923 472.9028 505.5929 539.4042 576.9888 608.9178 625.8520 653.2639 678.5480 688.2516 695.2062 703.5798 709.6531 762.7016 815.1474 820.5477 830.0374 858.9089 936.9081 938.7114 958.4554 967.3970 971.0564 984.2624 986.1564 987.9866 1002.6718 1004.6016 1019.9494 1072.9127 1079.3329 1088.0110 1112.2925 1112.5604 1133.4637 1160.5790 1175.8841 1189.3703 1200.2105 1292.9338 1311.9849 1347.4977 1355.9409 1382.3000 1403.4049 1418.7237 1427.9322 1454.8620 1455.6235 1462.3446 1463.7380 1472.0696 1473.2881 1573.2280 1586.5897 1593.8074 1595.5932 2983.7997 3006.8219 3088.1673 3123.5420 3129.6921 3131.5941 3133.9239 3136.3621 3138.3459 3150.7873 3153.2170 3164.1219 3165.7855 3174.2293 3176.3624
redmass: 5.7910 3.9637 3.6749 4.4839 4.2668 4.0238 5.6031 4.0693 1.1988 5.2848 5.6109 4.9962 4.3721 2.2738 2.0729 3.4185 5.6216 6.6566 5.6917 7.2791 6.0399 2.8653 7.5842 3.0005 6.9486 3.8164 4.0732 5.2546 9.6173 6.5047 7.2496 8.2577 7.8144 10.7328 2.0869 7.2298 3.8187 1.5715 1.7662 2.8812 1.5411 1.2449 1.3646 1.3528 1.3519 1.1809 10.5887 1.3869 5.9260 1.4461 2.7345 1.3264 2.9365 3.2798 1.6362 2.7240 1.2731 1.3100 1.3117 1.9286 1.0556 1.1293 1.6409 1.2521 1.3115 1.3370 3.1592 8.9958 3.7719 1.1249 2.1158 1.0522 1.0510 1.1829 2.0260 1.2925 1.3830 7.4197 6.0689 5.8726 6.2418 1.0301 1.0291 1.1042 1.1062 1.1036 1.0860 1.1019 1.0889 1.0895 1.0927 1.0876 1.0968 1.0961 1.1002 1.0964
irintensity: 0.4391 0.2645 1.8161 1.7420 1.3641 2.9671 1.2597 1.3294 0.1761 1.2480 2.8755 5.6195 3.2290 1.9762 2.1819 6.0172 3.3297 4.4860 1.0663 12.0999 2.1610 0.2579 3.5965 0.9811 20.6096 12.3371 84.0441 22.6344 76.9228 1.7529 1.0388 97.7558 27.0071 87.5698 69.3115 24.3194 2.3780 28.3292 21.8458 40.6187 68.5783 0.1558 0.4758 1.2517 1.3093 7.5218 197.9343 0.0503 6.9061 16.8066 20.3815 0.0499 2.2337 40.4243 5.9260 34.7789 2.4623 5.9681 0.5208 68.0162 0.0647 8.4715 74.7448 0.6186 4.6520 0.1400 5.9785 1.0835 2.3078 3.7162 21.5966 15.2532 13.1359 118.9501 10.0053 85.8489 31.1268 2.6677 0.4175 0.9905 6.2735 50.7794 26.2973 21.9034 17.7821 18.1065 0.5290 9.4444 6.5565 2.2528 11.7531 8.5399 17.7787 7.1005 18.9495 2.4574
temp: 298.150 k
press: 1.00000 atm
elementType: 16 16 15 8 8 6 6 6 6 6 6 6 6 6 6 6 6 6 6 1 1 1 1 1 1 1 1 1 1 1 1 1 1 1
symmnumber: 1
zpe: 667774.8 jmol-1
zpe.correction: 0.254342 hartree
zpe.thermalcorrener: 0.274835 hartree
zpe.thermalcorrenthalpy: 0.275779 hartree
zpe.thermalcorrgfe: 0.200198 hartree
zpe.sumelectzpe: -1828.893782 hartree
zpe.sumelectthermal: -1828.873290 hartree
zpe.sumelectthermalent: -1828.872345 hartree
zpe.sumelectthermalfe: -1828.947926 hartree
dipole: 0.2286 0.8875 -0.7537
dipole: 1.1865
quadrupole: -120.0775 -119.4189 -135.2170
quadrupole: 14.3121 -11.2498 4.1262
quadrupole: 4.8269 5.4856 -10.3125 14.3121 -11.2498 4.1262
hfenergy: -1829.1481245 hartree
pointgroup: C01 [X(C14H15O2P1S2)]
dipole: -0.0655598 0.3877646 0.2515169 debye
polarizability: 276.1429473|-19.0800912|224.9374239|-24.479974|11.2670834|169.1110054 unknown
InChI: InChI=1S/C14H15O2PS2/c1-15-17(18,13-6-4-3-5-7-13)16-12-8-10-14(19-2)11-9-12/h3-11H,1-2H3
charge 0 multiplicity 1
34 atoms
S  -1.272028 -1.855673 -1.636565
S  5.268658 0.97575 0.062774
P  -1.779324 -0.75191 0.035036
O  -0.476521 -0.58079 1.257854
O  -2.946675 -1.404256 1.131147
C  -2.473609 0.936066 -0.222511
C  0.85421 -0.247946 0.899436
C  -3.084268 1.614328 0.860262
C  -2.367655 1.536487 -1.497322
C  1.319725 1.05796 1.180678
C  1.720918 -1.21489 0.345911
C  -3.597719 2.912942 0.65362
C  -2.880673 2.838219 -1.691009
C  3.544225 0.425924 0.361494
C  -3.494108 3.525812 -0.618206
C  2.662477 1.390689 0.917675
C  3.065475 -0.874971 0.07704
C  -2.737743 -2.785871 1.618714
C  6.060902 -0.555694 -0.675045
H  -3.167813 1.125712 1.835612
H  -1.898902 0.985822 -2.321032
H  0.632252 1.793402 1.610511
H  1.342919 -2.216799 0.123128
H  -4.07886 3.44402 1.481806
H  -2.803196 3.311157 -2.675598
H  3.024865 2.399787 1.143576
H  3.723121 -1.636171 -0.352893
H  -3.8931 4.534489 -0.772681
H  -1.864753 -2.823797 2.292839
H  -2.598433 -3.480373 0.76964
H  -3.660118 -3.032168 2.165125
H  5.564659 -0.836988 -1.617048
H  6.041568 -1.390384 0.043083
H  7.104828 -0.272683 -0.880251
