program: Gaussian 09
title: 000198678
version: EM64L-G09RevD.01
frameworkgroup: C1[X(C19H19N5O3)]
method: RPBEPBE
basis: SDD
operation: Freq
keyword: #p
keyword: freq=noraman
keyword: PBEPBE/SDD
title: #p freq=noraman PBEPBE/SDD
converged: YES YES NO NO
title: Mulliken charges:
elementType: O O O N N N N N C C C C C C C C C C C C C C C C C C C H H H H H H H H H H H H H H H H H H H
charge: -0.268853 -0.249685 -0.310856 -0.140575 -0.265442 -0.410577 -0.368416 -0.002144 0.347609 0.036311 0.099000 0.453543 -0.641438 -0.753114 -0.359213 -0.387072 0.169430 -0.517842 -0.214957 -0.211537 -0.251396 0.226596 0.241117 -0.252695 -0.465775 -0.180203 -0.320811 0.246748 0.243140 0.268718 0.259003 0.220292 0.272031 0.377837 0.282352 0.261795 0.266688 0.251511 0.228111 0.227666 0.230171 0.327603 0.294923 0.252621 0.239521 0.248262
chargesum: 0.00000
title: Mulliken charges with hydrogens summed into heavy atoms:
elementType: O O O N N N N N C C C C C C C C C C C C C C C C C C C
charge: -0.268853 -0.249685 -0.310856 -0.140575 -0.265442 -0.032740 -0.040813 -0.002144 0.347609 0.036311 0.099000 0.453543 0.117168 -0.001789 -0.076860 -0.125277 0.169430 0.000358 0.013154 0.016129 -0.021225 0.226596 0.241117 0.042228 -0.213154 0.059318 -0.072549
polarizability: 3.14706192e+02 5.34275311e+00 3.11151347e+02 -2.56685629e+01 -8.13815066e-01 1.45610236e+02
1716.lowfreq: -7.9510 -6.5736 -0.7425 -0.0007 -0.0004 0.0000 7.3553 20.4033 28.9831
frequency: 6.4004 20.3523 28.9535 40.9410 50.7232 57.4013 74.8696 79.5004 92.2905 102.7735 113.0661 135.5921 143.3279 156.8096 170.4403 174.9587 228.4885 244.0787 249.8482 269.8511 281.3131 287.7090 313.2438 321.2232 364.7828 376.7634 396.8886 406.3365 407.9694 418.8002 439.7107 500.2976 506.5704 526.9312 563.2984 572.4507 601.0006 608.2515 615.1018 619.9910 649.3671 659.4315 693.6562 700.8438 706.6961 717.6081 720.7553 755.8174 774.7359 797.6859 810.8322 832.3615 841.3037 847.8882 905.0538 913.7922 923.2973 927.3474 959.7269 969.6202 976.9171 985.8896 990.2981 1000.7873 1002.1298 1010.6828 1014.7612 1032.1575 1033.9738 1041.4473 1052.9713 1082.1336 1098.2760 1113.8327 1136.6231 1142.6819 1149.1579 1172.2495 1185.1028 1193.5043 1200.6712 1221.9444 1265.1033 1292.7643 1303.6638 1312.5433 1317.3808 1331.6048 1335.1256 1335.5604 1380.3234 1386.7811 1405.9450 1407.7402 1431.7743 1433.2910 1444.2670 1450.6072 1451.8087 1463.1419 1469.9993 1484.8424 1490.8372 1492.8686 1526.1014 1544.4469 1575.6941 1584.7193 1589.5161 1607.1597 1624.3720 1631.7872 1649.2501 2978.0885 2994.6573 3026.7428 3080.6669 3087.5464 3105.5025 3112.2268 3118.9476 3127.4851 3129.0496 3137.5667 3139.3580 3152.9029 3158.4857 3166.0829 3176.4857 3189.7000 3236.6808 3554.0990
redmass: 6.3070 4.6169 5.0396 5.8019 4.0714 3.8218 2.5044 2.9615 2.7571 6.5000 4.6274 5.4569 3.4943 3.5462 1.5370 2.2289 5.6224 4.0987 5.5868 3.8794 3.2435 6.4611 4.1171 4.4481 5.2885 3.7498 4.0315 4.1081 3.1530 5.1188 4.5818 3.4198 4.7493 4.4036 1.3005 4.7255 5.8656 7.3578 6.3719 5.4230 5.6066 5.3969 2.6954 5.3176 3.9938 5.7221 2.0134 2.1880 3.3016 4.3660 5.3967 1.7502 1.2511 1.2649 2.0858 1.6784 1.4895 4.0565 1.4707 1.3675 3.4489 4.1643 1.4543 1.7212 2.4649 3.3572 3.3655 1.9526 2.8393 1.5472 2.4511 1.7831 1.8991 1.6651 2.0182 2.7250 2.8099 1.0528 1.1541 3.4076 1.3195 1.8441 1.9409 1.9906 3.5698 8.6951 1.6378 1.3337 1.5479 2.0307 3.1862 4.5022 2.0108 1.4657 1.1829 1.1792 2.0393 1.1731 1.8010 1.0712 1.0922 2.3955 2.1521 1.1457 2.3894 3.8822 6.1259 5.7296 6.4835 6.5231 7.8787 6.0988 7.1949 1.0417 1.0373 1.0622 1.0983 1.0921 1.0984 1.0911 1.1021 1.1007 1.0858 1.0894 1.0891 1.0942 1.0920 1.0995 1.1003 1.0961 1.0831 1.0785
irintensity: 1.6499 1.0059 0.5353 2.3428 2.9395 4.1428 2.0211 3.7169 1.0363 8.7234 6.6394 15.4007 8.5850 2.1160 6.2016 8.9954 3.9536 0.2132 3.0187 0.9774 4.7098 4.2076 7.5906 1.3794 4.5371 6.4168 4.9820 3.2660 1.6157 9.3663 15.2219 13.2886 0.6437 21.2562 147.6728 9.4229 11.1269 9.5101 7.9218 9.5694 4.7504 10.0500 21.9535 0.7377 38.9926 13.9293 65.2479 42.4074 32.2275 0.0920 12.9456 33.6816 0.4858 90.2372 1.9039 11.3550 1.9409 12.0353 2.1569 0.6505 2.8783 0.3635 0.4782 5.3397 2.8663 13.7971 5.7546 2.0284 1.5024 2.2040 15.0965 12.8958 6.7051 9.3572 68.8398 6.4221 24.2447 0.2172 0.0519 10.9264 0.9021 61.2380 7.9779 98.0581 115.0224 0.3601 71.8237 17.7642 50.9139 37.1090 41.0183 23.3545 11.8196 49.5726 27.4436 27.7999 19.0224 3.2400 40.0125 9.7242 59.8983 137.2321 101.6293 20.3995 332.9298 57.7919 92.1737 44.6061 4.7405 113.8816 394.5200 90.8236 40.3845 58.2229 18.9638 14.1263 10.9993 14.7772 14.6436 17.6372 5.7323 10.6890 1.3481 9.6990 11.4684 24.6990 9.5332 22.9224 13.8655 1.6854 389.8091 26.3351
temp: 298.150 k
press: 1.00000 atm
elementType: 8 8 8 7 7 7 7 7 6 6 6 6 6 6 6 6 6 6 6 6 6 6 6 6 6 6 6 1 1 1 1 1 1 1 1 1 1 1 1 1 1 1 1 1 1 1
symmnumber: 1
zpe: 934335.0 jmol-1
zpe.correction: 0.355869 hartree
zpe.thermalcorrener: 0.380696 hartree
zpe.thermalcorrenthalpy: 0.381640 hartree
zpe.thermalcorrgfe: 0.297388 hartree
zpe.sumelectzpe: -1232.930210 hartree
zpe.sumelectthermal: -1232.905383 hartree
zpe.sumelectthermalent: -1232.904439 hartree
zpe.sumelectthermalfe: -1232.988691 hartree
dipole: -3.3113 1.1041 -1.0506
dipole: 3.6452
quadrupole: -140.0798 -140.5308 -164.5651
quadrupole: -2.2050 0.9430 4.1263
quadrupole: 8.3121 7.8611 -16.1732 -2.2050 0.9430 4.1263
hfenergy: -1233.2860794 hartree
pointgroup: C01 [X(C19H19N5O3)]
dipole: 1.3493162 -0.3175266 -0.3677589 debye
polarizability: 311.8729481|5.6266091|312.1649019|30.9111004|2.4596187|147.4299245 unknown
InChI: InChI=1S/C19H19N5O3/c1-13-17(19(27)24(23(13)2)15-8-4-3-5-9-15)22-16(25)12-21-18(26)14-7-6-10-20-11-14/h3-11,21-22H,12H2,1-2H3
charge 0 multiplicity 1
46 atoms
O  0.455029 0.877313 0.209232
O  -0.273458 -3.808458 -0.999701
O  -2.569521 -0.826218 1.623448
N  3.288297 -1.274562 -0.089064
N  2.679686 0.022709 -0.136139
N  -0.240941 -2.035575 0.549535
N  -3.172144 -2.083728 -0.228987
N  -6.054947 0.996136 -1.196634
C  2.24982 -2.208664 0.12984
C  1.048114 -1.532322 0.271602
C  1.269179 -0.090926 0.112959
C  3.470409 1.202435 0.002656
C  4.321952 -1.539196 -1.122138
C  2.538222 -3.678103 0.194678
C  2.970764 2.427723 -0.508992
C  4.727207 1.16247 0.661465
C  -0.852183 -3.067675 -0.149359
C  -2.354207 -3.235909 0.197391
C  3.737402 3.602658 -0.362814
C  5.490246 2.343345 0.781702
C  5.002028 3.568136 0.270665
C  -3.237172 -0.933867 0.537051
C  -4.090095 0.184106 0.025431
C  -3.712717 1.514971 0.339054
C  -5.2730 -0.020765 -0.731749
C  -4.512134 2.57471 -0.133461
C  -5.662569 2.27168 -0.900995
H  3.891717 -1.509072 -2.142202
H  4.748548 -2.536569 -0.935241
H  5.125717 -0.791544 -1.045974
H  1.797377 -4.166619 0.847542
H  3.547136 -3.873087 0.598576
H  2.438113 -4.157491 -0.795603
H  -0.860179 -1.460927 1.156051
H  1.990389 2.448509 -0.990046
H  5.077778 0.224229 1.104039
H  -2.475708 -3.353135 1.289249
H  -2.711737 -4.142513 -0.313597
H  3.345899 4.548461 -0.753189
H  6.459622 2.307924 1.291314
H  5.594769 4.483564 0.371485
H  -3.558397 -2.084225 -1.174607
H  -2.807813 1.684862 0.931009
H  -5.638524 -1.032047 -0.951931
H  -4.252087 3.615998 0.078816
H  -6.302387 3.069059 -1.295464
