program: Gaussian 09
title: 000198658
version: EM64L-G09RevD.01
frameworkgroup: C1[X(C23H19ClO2)]
method: RPBEPBE
basis: SDD
operation: Freq
keyword: #p
keyword: freq=noraman
keyword: PBEPBE/SDD
title: #p freq=noraman PBEPBE/SDD
converged: YES YES NO NO
title: Mulliken charges:
elementType: Cl O O C C C C C C C C C C C C C C C C C C C C C C C H H H H H H H H H H H H H H H H H H H
charge: -0.057622 -0.309345 -0.448033 0.015683 0.224406 -0.638536 0.456141 0.106211 0.185041 0.486503 0.187216 -0.805663 -0.339785 -0.407164 -0.415243 -0.352325 -0.439877 -0.402279 -0.222533 -0.230923 -0.244413 -0.221822 -0.114131 -0.230897 -0.232617 -0.240975 0.234806 0.207467 0.378223 0.229200 0.231535 0.261708 0.267796 0.252404 0.237426 0.253091 0.261447 0.232839 0.255554 0.254647 0.225207 0.229366 0.225947 0.226266 0.228052
chargesum: 0.00000
title: Mulliken charges with hydrogens summed into heavy atoms:
elementType: Cl O O C C C C C C C C C C C C C C C C C C C C C C C
charge: -0.057622 -0.309345 -0.069811 0.015683 0.224406 -0.196262 0.456141 0.106211 0.185041 0.486503 0.187216 -0.083220 -0.071989 -0.154761 -0.177817 -0.099234 -0.178430 -0.169439 0.033021 0.023724 -0.019206 0.007544 -0.114131 -0.004950 -0.006351 -0.012923
polarizability: 3.48467749e+02 1.26371461e+01 2.38998474e+02 -2.15988584e+01 1.70319434e+01 1.88773505e+02
1716.lowfreq: -83.2631 -4.7774 -1.8567 -0.0019 -0.0006 0.0010 9.1383 17.9632 25.4176
frequency: -83.2490 17.5736 25.3844 30.1041 36.1509 45.3806 54.9090 92.2749 122.1470 127.9099 146.6942 169.4298 188.2500 211.0269 240.8874 256.1317 260.6420 285.8150 315.6427 326.3210 347.9986 376.3456 384.5907 404.8257 406.8993 409.1278 428.6445 455.3383 463.4032 503.1786 532.7529 553.7011 569.1541 573.5592 579.8838 617.5896 620.4533 627.1779 664.5075 689.7439 704.4670 705.9338 719.2353 749.7576 755.8611 758.8256 782.5982 808.3867 821.2700 830.0261 849.9795 854.3571 856.1078 867.9238 904.4300 934.3596 936.8245 945.7862 968.5574 976.1545 976.4613 989.8085 994.4257 998.3658 1002.0080 1008.1908 1014.4352 1027.8861 1037.2488 1058.4345 1074.8122 1077.5820 1085.9087 1101.5925 1117.2616 1153.0076 1162.7717 1172.2683 1175.6919 1187.9222 1188.9833 1202.8490 1218.5845 1235.2238 1272.0614 1277.7011 1296.8570 1330.0452 1337.2653 1366.3840 1372.3911 1384.0183 1390.5457 1403.1867 1412.5062 1439.3932 1441.6513 1461.7756 1462.2413 1471.0457 1479.4511 1481.4657 1484.1665 1586.4477 1592.4130 1593.0462 1596.1253 1600.4129 1614.3184 1625.4900 2982.6028 2994.1070 3058.8348 3061.6843 3087.4254 3116.4496 3122.5484 3131.2754 3135.2100 3144.5670 3145.8660 3152.1314 3155.8165 3160.2489 3162.4305 3171.4384 3175.9226 3176.0608 3516.8628
redmass: 1.0325 4.1475 4.6287 5.2775 5.8222 4.0317 5.8415 4.8489 6.8618 5.9186 3.3131 5.4353 6.7197 7.2212 3.2594 4.8674 6.1049 5.0082 3.8190 5.2859 3.0407 1.7634 2.2110 3.3664 3.8184 2.4877 3.2143 4.3289 3.7978 4.7689 4.0737 4.5518 5.1177 4.7169 4.4915 6.2941 5.0834 6.1846 5.5947 5.6757 6.0352 1.7579 3.5088 2.2805 2.4627 1.7439 3.2769 4.3576 1.5106 1.4331 5.1502 1.2650 1.3985 2.4488 2.1032 2.2011 1.3812 1.3686 1.3775 1.3924 1.3094 5.5554 1.3915 2.2479 3.6172 2.1396 4.8234 2.1852 1.5341 2.1997 2.7855 3.1494 2.1172 1.8818 1.3892 1.6051 1.3525 1.0577 2.1157 1.1540 1.1405 1.7007 2.3930 2.4125 1.5869 1.3718 1.2594 1.2629 2.0761 3.4945 3.7131 7.5955 3.5703 1.3374 3.8312 2.8994 2.1627 1.1923 1.7345 1.0576 2.2714 1.4348 2.2483 7.6116 6.0479 6.9299 9.0493 6.2836 6.1434 8.0168 1.0384 1.0587 1.1028 1.0965 1.0989 1.0868 1.0863 1.0856 1.0916 1.0906 1.0962 1.0875 1.0884 1.0958 1.1016 1.0962 1.0988 1.0975 1.0651
irintensity: 0.1255 0.1715 0.0325 0.1735 0.0684 0.1561 0.0966 0.1437 0.6535 0.1572 1.3764 1.1692 0.7743 0.7584 0.5474 7.1201 3.2510 3.6269 19.1950 2.2449 31.5240 123.2466 36.1317 0.8737 4.0312 27.5219 9.3315 14.2261 3.1857 11.8584 6.9393 14.3514 1.6365 4.8795 2.7160 0.9252 3.7028 2.0726 15.3995 7.0591 8.3270 52.8289 13.7214 38.7087 23.0283 57.6770 1.7955 11.3601 50.9661 30.7842 3.4424 0.4876 0.1154 9.1616 29.7430 25.6673 2.4705 0.7871 0.3628 0.4647 0.0546 0.7086 1.0853 17.8651 55.3349 4.0890 37.0664 6.7821 6.6183 2.6858 49.3194 11.5032 28.4706 4.5987 3.0821 11.6717 10.1144 0.0533 27.0586 3.6590 1.8777 7.7278 0.9572 33.0230 4.6662 9.5169 1.1093 0.5293 71.1272 29.1094 25.6941 0.5395 10.3768 9.4312 11.3033 24.4862 7.9138 13.6757 9.3520 11.9480 41.6329 30.2879 36.4303 6.4395 0.9137 0.0332 1.4584 15.3108 6.1344 1.1691 25.9001 29.7174 14.2599 16.0528 18.7315 8.5382 0.2073 1.7002 17.4570 12.2701 34.4265 6.4455 2.1238 25.0399 22.0799 7.9860 13.7796 0.1178 8.1816
temp: 298.150 k
press: 1.00000 atm
elementType: 17 8 8 6 6 6 6 6 6 6 6 6 6 6 6 6 6 6 6 6 6 6 6 6 6 6 1 1 1 1 1 1 1 1 1 1 1 1 1 1 1 1 1 1 1
symmnumber: 1
zpe: 918600.5 jmol-1
zpe.correction: 0.349876 hartree
zpe.thermalcorrener: 0.371892 hartree
zpe.thermalcorrenthalpy: 0.372836 hartree
zpe.thermalcorrgfe: 0.296251 hartree
zpe.sumelectzpe: -1496.536939 hartree
zpe.sumelectthermal: -1496.514924 hartree
zpe.sumelectthermalent: -1496.513980 hartree
zpe.sumelectthermalfe: -1496.590564 hartree
dipole: 2.7256 0.8367 1.7448
dipole: 3.3427
quadrupole: -161.9729 -152.5732 -152.4709
quadrupole: 1.8914 -6.3675 1.4933
quadrupole: -6.3006 3.0992 3.2014 1.8914 -6.3675 1.4933
hfenergy: -1496.8868155 hartree
pointgroup: C01 [X(C23H19Cl1O2)]
dipole: 1.1134847 -0.1918876 -0.6729334 debye
polarizability: 347.5372796|-11.3759614|232.7313685|25.8073161|23.200155|195.9710799 unknown
InChI: InChI=1S/C23H19ClO2/c1-16-20-9-5-6-10-21(20)26-22(16)23(25,15-17-7-3-2-4-8-17)18-11-13-19(24)14-12-18/h2-14,25H,15H2,1H3
charge 0 multiplicity 1
45 atoms
Cl -6.719415 -0.601779 -0.348991
O  1.218135 -0.542061 0.970181
O  -0.645086 1.179647 1.797932
C  -0.748757 0.835344 0.363387
C  0.107689 -0.395378 0.080453
C  -0.254674 2.0512 -0.503123
C  -2.238681 0.517498 0.142181
C  0.116524 -1.379619 -0.895693
C  1.289289 -2.210427 -0.627582
C  1.17778 2.46668 -0.214342
C  1.934003 -1.666665 0.51911
C  -0.861457 -1.586962 -2.026494
C  -2.858633 -0.394412 1.03434
C  -3.013144 1.086471 -0.894672
C  1.852998 -3.358182 -1.240624
C  3.099142 -2.190892 1.093275
C  1.47098 3.336703 0.869002
C  2.250563 1.986828 -1.008885
C  -4.218163 -0.740402 0.895734
C  -4.378488 0.752202 -1.051391
C  3.027976 -3.907793 -0.684769
C  3.64384 -3.334426 0.464908
C  -4.959441 -0.160135 -0.153425
C  2.804138 3.709731 1.154705
C  3.583653 2.358168 -0.726748
C  3.86545 3.220122 0.358793
H  -0.941833 2.890828 -0.289234
H  -0.357548 1.785005 -1.572046
H  0.311959 1.110887 2.058961
H  -0.870567 -0.735014 -2.731791
H  -0.597111 -2.488691 -2.604729
H  -1.894368 -1.712994 -1.657314
H  -2.270236 -0.817564 1.853862
H  -2.573355 1.800503 -1.596724
H  1.39181 -3.813001 -2.124093
H  3.55999 -1.737447 1.975148
H  0.648533 3.728308 1.478885
H  2.039765 1.315938 -1.851154
H  -4.692415 -1.441495 1.58864
H  -4.97404 1.19606 -1.854322
H  3.479165 -4.794329 -1.143669
H  4.55567 -3.786463 0.869592
H  3.013449 4.385194 1.992103
H  4.399619 1.978113 -1.351759
H  4.898892 3.512205 0.577078
