program: Gaussian 09
title: 000198600
version: EM64L-G09RevD.01
frameworkgroup: C1[X(C22H17ClO2)]
method: RPBEPBE
basis: SDD
operation: Freq
keyword: #p
keyword: freq=noraman
keyword: PBEPBE/SDD
title: #p freq=noraman PBEPBE/SDD
converged: YES YES NO NO
title: Mulliken charges:
elementType: Cl O O C C C C C C C C C C C C C C C C C C C C C C H H H H H H H H H H H H H H H H H
charge: -0.065042 -0.316601 -0.464379 -0.022562 -0.639288 0.362565 0.422651 0.454770 -0.510982 0.307267 0.175755 -0.361713 -0.392546 -0.380269 -0.447683 -0.418096 -0.370239 -0.229174 -0.207237 -0.111547 -0.229364 -0.230649 -0.238043 -0.218744 -0.236922 0.249328 0.238002 0.289448 0.363783 0.266260 0.291499 0.254924 0.260537 0.247128 0.252878 0.253787 0.253524 0.229562 0.229503 0.226573 0.229898 0.231437
chargesum: 0.00000
title: Mulliken charges with hydrogens summed into heavy atoms:
elementType: Cl O O C C C C C C C C C C C C C C C C C C C C C C
charge: -0.065042 -0.316601 -0.100596 -0.022562 -0.151957 0.362565 0.422651 0.454770 -0.221534 0.307267 0.175755 -0.095453 -0.101048 -0.125345 -0.187146 -0.170968 -0.117360 0.024613 0.046287 -0.111547 0.000198 -0.001146 -0.011470 0.011154 -0.005485
polarizability: 3.15617703e+02 2.25155626e+01 2.54555245e+02 2.86651727e+00 -3.46097755e+01 1.83759051e+02
1716.lowfreq: -5.2256 -3.1903 -0.0018 -0.0010 -0.0007 5.8802 22.8371 26.3549 32.8388
frequency: 22.6719 26.2656 32.8311 40.6883 51.7607 55.6645 93.3334 117.5011 141.6008 153.4000 189.2380 215.7211 250.3314 258.7604 291.6287 307.9644 313.0004 327.4755 371.1073 387.6106 400.9954 409.0859 415.2549 427.8526 452.1843 471.2381 493.5448 524.8211 560.3191 564.0493 571.0809 603.8652 612.0415 617.4373 625.6378 657.1548 695.9812 708.5651 719.4604 748.1692 754.2807 755.6135 777.9284 796.9574 829.5622 837.3632 844.1723 850.3788 860.0226 866.7508 868.7057 902.2040 908.1951 930.8759 938.6397 959.2740 973.6665 978.8421 981.6091 986.2798 989.9788 998.5181 1001.2028 1007.5935 1027.4134 1031.4916 1072.8545 1080.4093 1096.4150 1112.1970 1124.4461 1152.4743 1155.8081 1161.4552 1173.4528 1187.1195 1189.0700 1199.8894 1211.6096 1247.0801 1257.7397 1286.8190 1294.3813 1306.3929 1330.2892 1333.3481 1372.6216 1382.1304 1390.3936 1412.0693 1439.9049 1440.1284 1456.9853 1464.2307 1475.0543 1482.4273 1581.3875 1586.3473 1589.2573 1597.4163 1599.0425 1611.5855 1624.4209 3019.3079 3082.4692 3119.8138 3128.0429 3133.9945 3139.9295 3147.6026 3148.8650 3150.1023 3161.5950 3162.4656 3165.5796 3172.5355 3174.4496 3186.7797 3238.7605 3494.3623
redmass: 5.2216 5.7730 4.2883 5.4260 4.3227 5.1371 6.3853 4.9253 7.2289 6.8229 7.4463 6.0690 4.3234 5.5516 7.1758 5.7363 5.3048 5.4968 2.0061 1.7990 3.4713 2.9295 2.0015 2.9602 4.2831 4.1440 3.9582 4.4422 6.1556 4.8736 3.7055 6.0432 4.9647 6.2258 7.0818 5.0182 5.8786 1.9007 3.3672 3.9866 1.3981 2.0155 3.3842 3.8819 1.7498 1.4467 1.3236 2.4399 1.2465 2.9082 1.6934 4.9945 2.8204 1.6290 1.3895 1.3799 2.0669 1.3075 1.4071 1.6037 5.7090 1.3223 4.3940 2.0889 2.2617 4.3167 2.7209 1.7563 2.1462 1.3655 1.6192 1.9214 1.8895 1.1637 1.0553 1.1786 1.1370 1.7455 2.5776 2.2253 2.1973 1.4301 1.2803 1.9545 1.2851 1.6899 6.0168 7.3462 3.3292 4.6938 2.1635 2.9703 1.1204 2.9387 2.3421 2.2671 7.8244 7.8409 5.9726 6.7093 6.5925 6.0654 7.9541 1.0599 1.1034 1.0867 1.0866 1.0856 1.0918 1.0905 1.0887 1.0961 1.0960 1.0897 1.1015 1.0961 1.0995 1.0954 1.0983 1.0654
irintensity: 0.0652 0.0538 0.4570 0.0151 0.3068 0.0350 0.8503 0.5812 0.1544 1.4058 0.5691 0.2043 5.8835 0.9072 3.5849 1.4647 2.4121 0.1586 10.8229 81.4779 21.9578 0.9059 81.2263 27.9747 11.3060 7.2928 10.4168 7.2979 2.2819 24.9562 2.5535 2.0647 8.0409 0.3551 0.4862 30.1290 6.5012 47.9706 26.8331 7.1417 80.1565 9.5901 10.4228 7.1034 67.4323 11.1048 23.8528 8.6616 0.9276 5.1105 17.1491 3.0735 25.9393 4.9843 5.1780 3.7216 17.1402 0.0116 1.0981 11.3365 0.7412 0.5956 53.9310 6.8549 10.4757 20.8556 32.1399 23.0500 4.9711 3.1961 25.6012 24.9556 35.0440 1.6853 0.1109 7.9738 2.2329 1.6509 0.2794 37.6730 1.8272 9.0217 0.7813 13.7104 2.5381 52.4689 13.4900 0.5226 12.2882 5.4606 9.3198 30.6263 8.5004 10.7282 105.0617 21.1824 6.2987 4.4664 0.9350 2.1221 5.2360 5.7985 1.5922 19.3692 7.6715 4.8761 0.1002 1.5590 12.3124 10.1417 1.2833 30.9308 23.2389 2.3999 23.1309 2.7820 15.7125 2.7180 1.7545 42.6801
temp: 298.150 k
press: 1.00000 atm
elementType: 17 8 8 6 6 6 6 6 6 6 6 6 6 6 6 6 6 6 6 6 6 6 6 6 6 1 1 1 1 1 1 1 1 1 1 1 1 1 1 1 1 1
symmnumber: 1
zpe: 848691.4 jmol-1
zpe.correction: 0.323249 hartree
zpe.thermalcorrener: 0.344050 hartree
zpe.thermalcorrenthalpy: 0.344994 hartree
zpe.thermalcorrgfe: 0.271201 hartree
zpe.sumelectzpe: -1457.313981 hartree
zpe.sumelectthermal: -1457.293181 hartree
zpe.sumelectthermalent: -1457.292237 hartree
zpe.sumelectthermalfe: -1457.366030 hartree
dipole: 4.0783 -0.5418 -0.1036
dipole: 4.1154
quadrupole: -158.6877 -139.5879 -145.9462
quadrupole: 4.2289 0.8145 -7.0447
quadrupole: -10.6138 8.4860 2.1277 4.2289 0.8145 -7.0447
hfenergy: -1457.6372308 hartree
pointgroup: C01 [X(C22H17Cl1O2)]
dipole: 1.6106616 0.1534794 0.0614418 debye
polarizability: 313.7836531|-24.2208452|249.0662346|0.9109748|-41.381168|191.0821107 unknown
InChI: InChI=1S/C22H17ClO2/c23-19-12-10-18(11-13-19)22(24,15-16-6-2-1-3-7-16)21-14-17-8-4-5-9-20(17)25-21/h1-14,24H,15H2
charge 0 multiplicity 1
42 atoms
Cl -6.642312 -0.097761 0.234917
O  0.444765 -1.054853 0.909277
O  -0.361848 1.383605 -1.783487
C  -0.566776 0.801694 -0.449755
C  -0.10172 1.821064 0.664039
C  0.235014 -0.486692 -0.385767
C  -2.078249 0.542451 -0.30442
C  1.312473 2.337624 0.449202
C  0.81987 -1.262866 -1.363073
C  1.445168 -2.397439 -0.699851
C  1.191229 -2.237144 0.693949
C  -2.572202 -0.21809 0.785018
C  -2.991998 1.101605 -1.228612
C  2.436603 1.65452 0.985134
C  1.536208 3.507667 -0.326814
C  2.187117 -3.527349 -1.127304
C  1.628068 -3.127455 1.68317
C  -3.959626 -0.416959 0.955163
C  -4.383498 0.90947 -1.07204
C  -4.845031 0.154096 0.02132
C  3.746489 2.127691 0.752319
C  2.847984 3.982135 -0.562068
C  2.640193 -4.441187 -0.151723
C  2.366633 -4.246605 1.232438
C  3.957639 3.291403 -0.024448
H  -0.193996 1.319503 1.642963
H  -0.824708 2.656113 0.639966
H  0.790658 -1.050258 -2.428739
H  0.560384 1.754576 -1.813113
H  -1.877632 -0.671362 1.49966
H  -2.605554 1.677443 -2.07271
H  2.278868 0.75174 1.585858
H  0.676779 4.064109 -0.720773
H  2.402741 -3.690087 -2.188349
H  1.407812 -2.966471 2.742247
H  -4.341123 -1.005813 1.794078
H  -5.090681 1.338161 -1.787975
H  4.602063 1.590412 1.176614
H  3.001329 4.889808 -1.15661
H  3.213784 -5.321591 -0.461243
H  2.732577 -4.977039 1.961806
H  4.974501 3.658433 -0.20257
