program: Gaussian 09
title: 000198579
version: EM64L-G09RevD.01
frameworkgroup: C1[X(C10H9NO2S)]
method: RPBEPBE
basis: SDD
operation: Freq
keyword: #p
keyword: freq=noraman
keyword: PBEPBE/SDD
title: #p freq=noraman PBEPBE/SDD
converged: YES YES NO NO
title: Mulliken charges:
elementType: S O O N C C C C C C C C C C H H H H H H H H H
charge: 0.358591 -0.295253 -0.269654 -0.308572 -0.053710 -0.348962 -0.315778 0.381429 0.553268 -0.535597 -0.340998 -0.441116 -0.244074 -0.331068 0.252092 0.223219 0.230416 0.226843 0.219105 0.267544 0.256415 0.246236 0.269624
chargesum: 0.00000
title: Mulliken charges with hydrogens summed into heavy atoms:
elementType: S O O N C C C C C C C C C C
charge: 0.358591 -0.295253 -0.269654 -0.308572 0.198381 0.104672 0.130170 0.381429 0.553268 -0.268053 -0.084583 -0.441116 0.002162 -0.061444
polarizability: 2.11490910e+02 2.28271764e+00 1.32112567e+02 1.92057945e-01 -8.60802878e-01 6.93841041e+01
1716.lowfreq: -5.6556 -0.0017 -0.0007 0.0017 3.2201 6.7195 29.0634 50.1150 87.0974
frequency: 28.9983 50.1044 87.0932 95.9698 141.6487 197.4121 219.1266 248.8394 322.9639 336.0646 404.8755 420.6816 441.7553 487.5373 502.9327 526.7428 567.7789 619.7774 637.7808 709.4777 721.7689 750.6080 794.7250 804.2899 807.0608 854.2974 898.5098 903.1839 910.9703 941.5366 972.5804 991.5027 1028.5038 1041.4514 1097.3647 1112.9579 1137.5818 1150.7877 1165.8356 1214.0369 1223.8694 1238.7295 1248.3751 1276.5244 1347.3898 1378.9047 1403.7308 1417.7355 1439.4144 1471.4580 1478.8151 1486.6672 1562.5175 1618.2184 2965.5954 3029.7727 3072.9402 3117.4528 3150.4841 3151.2960 3164.1246 3171.6182 3183.4477
redmass: 7.3613 3.7881 4.7409 3.7780 7.9217 5.3981 4.7932 7.9228 6.7191 5.7744 2.3122 3.2810 6.3856 4.2163 7.5031 6.8233 8.4121 3.0887 8.6714 7.2975 3.2781 8.0483 4.9858 4.2627 1.5465 1.3879 1.1890 1.6635 4.3653 1.3551 1.7987 3.4088 1.4514 5.1652 1.3675 1.3295 1.5518 1.7748 1.4555 1.3165 1.4967 1.4411 2.2725 2.0851 1.4267 4.5408 3.9641 2.0420 4.3053 1.3645 1.8602 1.3894 7.1918 7.0189 1.0557 1.1071 1.0533 1.0919 1.0880 1.0932 1.0927 1.0960 1.1192
irintensity: 1.4708 2.1687 2.8293 2.6386 5.2601 0.2761 8.3166 3.2215 2.3866 2.9114 0.5521 0.8523 8.2116 30.6195 1.2413 3.5543 19.3542 0.0143 4.8665 2.1741 4.9993 6.9215 14.8561 41.3137 39.6806 0.1861 7.1051 51.8624 11.1837 0.6181 5.8878 110.9326 0.7587 0.0664 4.8119 14.6856 15.0008 115.3183 15.5077 14.1940 81.4993 0.4532 57.2195 112.6951 16.9708 7.4945 35.6895 1.1859 4.0645 59.7868 53.6967 18.0605 24.2264 45.0106 32.3218 27.5598 22.5523 14.8976 4.5328 3.2268 1.6476 9.7218 28.4904
temp: 298.150 k
press: 1.00000 atm
elementType: 16 8 8 7 6 6 6 6 6 6 6 6 6 6 1 1 1 1 1 1 1 1 1
symmnumber: 1
zpe: 442296.5 jmol-1
zpe.correction: 0.168462 hartree
zpe.thermalcorrener: 0.180712 hartree
zpe.thermalcorrenthalpy: 0.181656 hartree
zpe.thermalcorrgfe: 0.128269 hartree
zpe.sumelectzpe: -988.635926 hartree
zpe.sumelectthermal: -988.623676 hartree
zpe.sumelectthermalent: -988.622732 hartree
zpe.sumelectthermalfe: -988.676119 hartree
dipole: -2.7678 0.0309 0.3686
dipole: 2.7924
quadrupole: -114.0138 -79.6661 -88.9094
quadrupole: -10.4886 -3.3903 -0.3479
quadrupole: -19.8173 14.5304 5.2870 -10.4886 -3.3903 -0.3479
hfenergy: -988.804388 hartree
pointgroup: C01 [X(C10H9N1O2S1)]
dipole: 1.0911955 -0.0651426 0.1094498 debye
dipolederiv: -0.1342857 -0.1393483 0.0019084 0.0476395 -0.2954699 -0.0566054 0.026811 -0.0421652 0.1377736 -0.6368978 -0.100901 0.0765059 -0.1370433 -0.4978664 0.0250964 0.1050824 0.0266174 -0.3010968 -2.1265434 0.032599 0.0821654 0.1799204 -0.276036 -0.0081383 0.1730534 0.0031544 -0.2843788 -0.4908945 -0.0520502 0.0033442 -0.2213738 0.4077027 0.1012035 -0.0128226 0.0894691 -0.2970621 0.3403644 -0.0598888 -0.0116705 -0.0493158 0.2349681 0.105176 -0.1377175 0.0408726 0.2434086 0.1488702 0.0048709 -0.1370413 -0.0659047 0.2589915 -0.0337214 -0.0218712 0.031362 0.2048252 1.0271037 0.0976432 0.0354288 0.5429612 0.2837454 -0.0901855 -0.0109928 -0.0460037 0.324711 1.7153757 -0.2249734 -0.1144714 -0.5576407 -0.0475606 0.0123099 -0.1790622 -0.0030759 0.0997785 -0.0108398 -0.219861 -0.0189033 -0.0081559 -0.1571185 -0.0307625 0.0060542 -0.0130158 0.0824789 -0.3755579 0.1921982 0.0258372 -0.1710452 0.0991508 0.0456333 -0.0007227 0.0194428 -0.1691689 -0.2386459 -0.0835066 -0.0116521 0.2416248 0.014031 0.0151937 0.03063 0.0344567 -0.1899697 0.4603523 -0.1248476 -0.0596563 -0.0041595 -0.2777331 -0.0134369 -0.0470141 -0.0047757 -0.1563114 -0.1017998 0.1270066 0.0165325 -0.0020669 0.1892764 0.0304254 0.0019478 0.0208054 -0.0724899 0.1475353 0.3188201 0.0239361 0.2513717 0.134633 0.0075415 0.0147195 -0.0004196 -0.0577048 0.01332 0.0164027 -0.0201342 0.0484695 0.0385163 -0.0816827 -0.0157131 -0.0955445 -0.0540004 0.1066969 0.0195087 0.0912944 0.0389809 0.0387482 -0.0240575 0.0669874 0.012266 -0.0996333 0.0106483 0.1085539 0.0224784 0.123211 -0.0633094 0.0338914 0.0074687 0.0052729 0.0592715 -0.056069 0.0495487 -0.0577281 -0.0877489 -0.0469197 0.103639 -0.0128957 0.1086965 -0.0407391 -0.0212453 0.0028692 0.0124013 -0.1080371 0.0025322 -0.0563388 -0.0194726 -0.0981785 -0.0947301 0.0855975 0.0150649 0.0099438 0.0465988 -0.012352 -0.0259567 0.0123001 -0.0242392 0.173929 -0.0185601 -0.0975869 0.0024116 -0.1085291 0.0439584 -0.0102619 -0.0005754 -0.0074956 0.1611928 0.0659757 0.0524935 0.0126468 0.0191394 -0.0415196 -0.0252503 0.009604 -0.027979 0.1571181 0.0894991 0.065384 0.0144226 -0.0188962 -0.0303688 -0.0237121 0.0042012 -0.0295231 0.172798 unknown
polarizability: 211.4180606|-0.6770037|131.6153009|-4.2875576|5.3294889|69.9542192 unknown
InChI: InChI=1S/C10H9NO2S/c1-2-10-7(4-11-14-10)3-8(1)12-5-9-6-13-9/h1-4,9H,5-6H2
charge 0 multiplicity 1
23 atoms
S  -4.22485 0.978462 0.305982
O  5.179694 0.413366 -0.209916
O  1.550651 -0.542679 -0.308104
N  -4.513088 -0.822061 0.111859
C  3.921418 -0.349707 -0.548138
C  4.772608 -0.803491 0.59478
C  2.651342 0.436458 -0.310644
C  0.241778 -0.052811 -0.153242
C  -2.121009 -0.615968 -0.042443
C  -0.77573 -1.026463 -0.19324
C  -0.07337 1.32624 0.0359
C  -2.433774 0.769023 0.146475
C  -1.413476 1.739234 0.185963
C  -3.329337 -1.424591 -0.048654
H  3.968621 -0.90341 -1.493865
H  4.450097 -0.587093 1.620732
H  5.42258 -1.676619 0.467669
H  2.498485 1.178497 -1.120592
H  2.70617 0.969065 0.659946
H  -0.509912 -2.07746 -0.340108
H  0.717834 2.080554 0.069123
H  -1.64178 2.799458 0.330423
H  -3.345351 -2.512205 -0.177707
