program: Gaussian 09
title: 000198578
version: EM64L-G09RevD.01
frameworkgroup: C1[X(C6HCl6N)]
method: RPBEPBE
basis: SDD
operation: Freq
keyword: #p
keyword: freq=noraman
keyword: PBEPBE/SDD
title: #p freq=noraman PBEPBE/SDD
converged: NO YES NO NO
title: Mulliken charges:
elementType: Cl Cl Cl Cl Cl Cl N C C C C C C H
charge: 0.023486 0.058288 0.057674 0.074002 0.067634 0.055645 0.165988 0.388436 -0.253115 -0.742407 0.121628 -0.016193 -0.344837 0.343772
chargesum: 0.00000
title: Mulliken charges with hydrogens summed into heavy atoms:
elementType: Cl Cl Cl Cl Cl Cl N C C C C C C
charge: 0.023486 0.058288 0.057674 0.074002 0.067634 0.055645 0.165988 0.388436 -0.253115 -0.398635 0.121628 -0.016193 -0.344837
polarizability: 1.71701725e+02 4.96147502e+00 1.56263620e+02 2.93755034e-02 1.36496407e-01 7.52263736e+01
1716.lowfreq: -1.8872 0.0015 0.0015 0.0028 2.0217 2.7414 19.4404 42.5502 74.9964
frequency: 19.4244 42.5443 74.9954 89.2122 113.0564 164.1501 195.2874 207.0570 209.0121 220.9350 277.2334 301.0865 317.6198 335.3810 390.3906 455.0193 496.5012 567.6679 570.4623 606.0431 693.7037 699.8730 718.3032 780.7993 789.0889 924.4777 1008.0168 1206.7443 1221.7570 1227.3726 1307.7342 1327.0373 1358.8591 1483.6919 1526.5706 3163.7942
redmass: 23.1175 30.0780 34.1440 23.9269 25.1809 32.8308 32.0963 34.1790 15.2829 26.3645 13.9814 22.6848 29.7446 29.5628 12.9432 11.1282 16.3138 12.3796 13.4263 12.4644 10.6406 10.7617 8.2389 11.1644 10.9333 7.6697 9.3433 1.0656 6.7543 1.9777 3.9311 6.9390 9.2145 9.7259 12.4488 1.0886
irintensity: 0.4165 0.0569 0.0024 0.0248 0.8258 0.4445 0.0174 0.0135 0.0173 0.7140 0.0556 0.1921 0.4841 0.9367 0.5813 26.5251 17.3251 1.1378 46.2785 46.4884 73.2583 67.4449 13.2611 16.2805 19.0111 30.6975 10.3160 10.1596 108.6369 74.7445 199.7355 46.2309 9.9048 38.6044 13.2409 1.0169
temp: 298.150 k
press: 1.00000 atm
elementType: 17 17 17 17 17 17 7 6 6 6 6 6 6 1
symmnumber: 1
zpe: 150076.9 jmol-1
zpe.correction: 0.057161 hartree
zpe.thermalcorrener: 0.070438 hartree
zpe.thermalcorrenthalpy: 0.071383 hartree
zpe.thermalcorrgfe: 0.013686 hartree
zpe.sumelectzpe: -3043.380583 hartree
zpe.sumelectthermal: -3043.367305 hartree
zpe.sumelectthermalent: -3043.366361 hartree
zpe.sumelectthermalfe: -3043.424058 hartree
dipole: -1.3871 2.4706 -0.0348
dipole: 2.8336
quadrupole: -117.8280 -117.1514 -115.7097
quadrupole: 4.3895 -0.0916 -0.0489
quadrupole: -0.9316 -0.2550 1.1867 4.3895 -0.0916 -0.0489
hfenergy: -3043.4377439 hartree
pointgroup: C01 [X(C6H1Cl6N1)]
dipole: 0.5097719 -0.9824236 0.1333855 debye
dipolederiv: -0.175726 -0.2577166 0.0465826 -0.2764752 -0.6297004 0.1112347 0.0499733 0.1120204 -0.0153596 -0.3931429 0.0497572 -0.2035319 0.1195353 -0.0916365 0.1152829 -0.2400141 0.0215498 -0.5735068 -0.3774447 0.0982947 0.1717037 0.1721459 -0.1695676 -0.2455114 0.1934816 -0.1494988 -0.5215526 -0.2211228 0.3108329 -0.0431902 0.2936181 -0.407554 0.0617526 -0.0403088 0.0618466 0.0185283 -0.792809 -0.1028247 0.0409245 -0.0775364 -0.0058263 0.0076338 0.03683 0.0079671 0.0244429 -0.1687554 -0.2630209 0.0460914 -0.3367517 -0.7435821 0.1242325 0.0570571 0.1217172 -0.0476317 -0.6299305 -0.3890495 0.0761411 -0.0053877 -0.4744276 0.0595441 0.0155006 0.0682412 -0.1131869 0.2792792 -0.0039419 -0.0087992 -0.1470632 0.0074877 -0.0040896 0.0081601 -0.0074548 -0.0612699 -0.0802257 0.4265052 -0.0674048 0.5450423 0.7531316 -0.1416595 -0.0893838 -0.1388632 0.0153899 0.8918717 -0.2199866 0.0431283 -0.2043773 0.2604682 0.1466875 0.0388262 0.1483506 1.2171917 0.2834437 -0.4972489 0.0722004 -0.5731521 0.603665 -0.0784528 0.0862318 -0.0812753 0.0229578 1.0656848 0.2525771 -0.0725626 0.0254117 -0.4599968 0.075018 -0.0360724 0.0677124 -0.0012258 0.2726077 0.5450963 -0.0918947 0.5012279 1.347587 -0.2249346 -0.0857331 -0.224079 0.0708867 0.0462698 0.0507256 -0.0093886 -0.0362377 0.0099516 -0.0067382 0.0054516 -0.0082344 -0.0356642 unknown
polarizability: 171.9513058|3.8544398|153.6915369|-3.5819385|-13.2389167|77.5488759 unknown
InChI: InChI=1S/C6HCl6N/c7-1-2(8)4(5(10)11)13-6(12)3(1)9/h5H
charge 0 multiplicity 1
14 atoms
Cl -0.878966 -2.796461 0.52272
Cl -3.223549 0.480899 -1.488769
Cl -3.137675 0.909639 1.54701
Cl 2.324451 -2.435715 0.368344
Cl 3.575601 0.508267 -0.145739
Cl 1.522997 3.021774 -0.487468
N  -0.425643 1.200021 -0.143109
C  -0.980767 -0.02423 0.069659
C  -0.157573 -1.164855 0.232822
C  -2.485457 -0.102262 0.122435
C  1.254151 -1.016226 0.168434
C  1.804674 0.267794 -0.055398
C  0.894054 1.350332 -0.203982
H  -2.856101 -1.120077 0.276144
