program: Gaussian 09
title: 000198572
version: EM64L-G09RevD.01
frameworkgroup: C1[X(C12H18N2O2S2)]
method: RPBEPBE
basis: SDD
operation: Freq
keyword: #p
keyword: freq=noraman
keyword: PBEPBE/SDD
title: #p freq=noraman PBEPBE/SDD
converged: YES YES NO NO
title: Mulliken charges:
elementType: S S O O N N C C C C C C C C C C C C H H H H H H H H H H H H H H H H H H
charge: 0.283908 0.290377 -0.245884 -0.231739 -0.092927 0.043359 -0.331404 -0.347602 -0.346706 -0.324543 -0.320423 -0.541079 0.197467 -0.421985 0.328202 -0.768679 -0.516422 -0.814038 0.191619 0.203867 0.213969 0.192559 0.199988 0.234217 0.191768 0.214296 0.214120 0.192617 0.248051 0.265291 0.240271 0.240815 0.293235 0.287542 0.287782 0.248114
chargesum: 0.00000
title: Mulliken charges with hydrogens summed into heavy atoms:
elementType: S S O O N N C C C C C C C C C C C C
charge: 0.283908 0.290377 -0.245884 -0.231739 -0.092927 0.043359 0.064082 0.058927 0.087498 0.081521 0.086314 -0.027737 0.197467 -0.421985 0.328202 0.005642 -0.516422 0.009399
polarizability: 2.82430654e+02 -2.23014401e+01 1.93670204e+02 1.73625304e+00 6.91381682e-01 1.10899051e+02
1716.lowfreq: -5.7795 -0.0003 0.0015 0.0023 2.2068 4.5381 17.9848 30.5580 37.9522
frequency: 17.0002 29.7064 37.8385 40.5169 53.8823 65.8619 75.5828 92.5714 112.0835 113.2895 150.2533 172.6923 186.3072 201.9506 239.3596 277.7302 279.7845 284.5352 315.7185 330.1105 376.2258 399.2620 434.5492 456.3682 471.0179 490.4874 500.8873 528.8721 568.5480 595.6711 637.6156 650.4456 650.7588 716.2945 784.4639 796.4792 812.3131 842.2409 889.6254 899.4002 946.5470 966.0488 982.1016 1001.1950 1005.3242 1018.3369 1028.6502 1030.5291 1044.3480 1054.6245 1071.6687 1092.7990 1104.7761 1131.4577 1141.2486 1190.8489 1194.6111 1211.0133 1247.9821 1268.7272 1290.9086 1292.4032 1296.9158 1312.2096 1332.3447 1342.5533 1345.5595 1363.1675 1372.0466 1387.4694 1393.0592 1411.4080 1431.2168 1433.1217 1436.5724 1444.2542 1449.1224 1452.0101 1452.5201 1459.2586 1471.6223 1476.8016 1512.9670 1561.5584 2858.6691 2868.2617 2887.3068 2953.4973 2957.3617 2971.0424 2989.5636 3019.1833 3026.4686 3028.9610 3032.2100 3051.1150 3066.2394 3080.0208 3083.3494 3140.7943 3156.9367 3163.7849
redmass: 4.0602 3.0586 1.9251 2.2110 3.6173 3.5564 3.7276 2.2374 1.6465 2.4861 3.4288 5.2340 4.6089 3.1235 1.8266 6.2831 6.5956 4.3531 2.3773 6.0834 4.2196 2.2147 6.8710 4.4657 3.2515 5.4484 4.8026 6.0302 3.7826 2.0355 8.7619 7.5831 4.0158 4.3261 2.8752 1.7712 3.7223 1.5995 7.1539 2.5333 4.5378 3.6222 1.1745 2.8874 1.3814 2.1780 2.2355 1.9277 1.5555 1.9818 3.1045 3.4978 2.0863 2.2873 2.7094 1.1308 1.4979 1.9120 1.4210 1.2748 1.7906 1.3683 1.5663 2.6530 1.2936 1.1917 1.2924 1.4494 1.2667 1.3591 1.4593 4.2047 1.1159 1.0526 1.3787 1.0817 1.0831 1.0882 1.0962 1.0913 1.0954 1.0471 3.0550 8.0872 1.0704 1.0695 1.0702 1.0665 1.0666 1.0596 1.0386 1.0959 1.0894 1.0277 1.0894 1.0911 1.0966 1.0961 1.0978 1.0986 1.1048 1.1062
irintensity: 0.1577 0.2352 0.1021 0.1101 2.1244 3.6091 2.8314 0.9342 1.0612 1.2578 1.6598 1.4820 3.7257 6.6495 2.1193 2.5120 4.5409 4.1043 13.8376 1.9759 1.5121 0.5186 33.0218 3.4034 0.5582 3.9983 0.3261 2.3714 0.2745 3.8625 13.1476 3.2339 0.5274 9.9890 5.2570 11.9625 38.6479 1.5291 7.3654 35.2323 117.8637 18.5553 6.9865 30.4010 18.3167 14.1166 11.8918 1.5282 8.7955 22.1336 17.3220 35.8763 5.9565 63.7303 17.3798 2.8927 27.0391 32.0772 47.5142 5.1696 23.1134 19.4784 25.1650 127.9318 20.6426 33.7645 24.1562 9.4943 3.7036 142.4089 13.2990 186.4213 35.2592 16.0049 146.5654 2.5880 0.6030 34.7429 19.6973 1.3537 15.2674 16.2613 198.9721 85.1759 53.8069 74.9319 111.8164 30.3956 103.5424 26.6352 13.6233 7.5991 43.2899 18.7726 42.2408 27.9632 11.5637 40.7435 39.0755 3.1243 5.1217 7.6918
temp: 298.150 k
press: 1.00000 atm
elementType: 16 16 8 8 7 7 6 6 6 6 6 6 6 6 6 6 6 6 1 1 1 1 1 1 1 1 1 1 1 1 1 1 1 1 1 1
symmnumber: 1
zpe: 749861.0 jmol-1
zpe.correction: 0.285607 hartree
zpe.thermalcorrener: 0.305624 hartree
zpe.thermalcorrenthalpy: 0.306568 hartree
zpe.thermalcorrgfe: 0.233347 hartree
zpe.sumelectzpe: -1522.717065 hartree
zpe.sumelectthermal: -1522.697048 hartree
zpe.sumelectthermalent: -1522.696104 hartree
zpe.sumelectthermalfe: -1522.769325 hartree
dipole: 3.6932 -0.7527 -0.1518
dipole: 3.7722
quadrupole: -116.3855 -127.1823 -121.6457
quadrupole: -5.6983 3.3475 -2.0980
quadrupole: 5.3524 -5.4445 0.0921 -5.6983 3.3475 -2.0980
hfenergy: -1523.0026723 hartree
pointgroup: C01 [X(C12H18N2O2S2)]
dipole: -1.4339505 -0.3737694 0.08122 debye
polarizability: 279.0503449|28.5783247|193.2924815|2.6264761|-16.5974731|114.6570824 unknown
InChI: InChI=1S/C12H18N2O2S2/c1-9-11(18-12(13-9)17-2)10(15)3-4-14-5-7-16-8-6-14/h3-8H2,1-2H3
charge 0 multiplicity 1
36 atoms
S  -1.943992 -1.377001 0.092565
S  -4.861715 -2.475806 0.279106
O  5.969214 -1.076114 0.077388
O  -0.262691 2.213158 -0.822026
N  3.28436 0.051267 0.121992
N  -4.1063 0.102961 -0.428688
C  3.623817 -1.10664 -0.746657
C  4.489036 0.900013 0.328631
C  2.137222 0.843804 -0.386097
C  4.776616 -1.914077 -0.126878
C  5.623714 0.065035 0.941915
C  0.802052 0.099924 -0.210097
C  -0.409941 0.989038 -0.50526
C  -1.750668 0.380856 -0.399553
C  -3.012682 0.958608 -0.622587
C  -3.296658 2.373799 -1.042401
C  -3.743307 -1.117921 -0.063448
C  -6.503213 -1.602229 -0.034972
H  3.920031 -0.768819 -1.77274
H  2.741461 -1.765729 -0.846841
H  4.228513 1.727928 1.014998
H  4.846365 1.348785 -0.632645
H  2.267177 1.136343 -1.457079
H  2.087808 1.786147 0.188092
H  4.447581 -2.34069 0.845518
H  5.09911 -2.726741 -0.798728
H  6.549504 0.656717 1.033788
H  5.313669 -0.304523 1.943292
H  0.747397 -0.797023 -0.859759
H  0.737203 -0.273856 0.832474
H  -3.858346 2.373807 -1.994764
H  -3.940992 2.863341 -0.289125
H  -2.365559 2.943492 -1.16011
H  -6.536958 -1.252675 -1.075648
H  -6.601083 -0.752218 0.653686
H  -7.275948 -2.36226 0.156356
