program: Gaussian 09
title: 000198582
version: EM64L-G09RevD.01
frameworkgroup: C1[X(C15H22N2O3)]
method: RPBEPBE
basis: SDD
operation: Freq
keyword: #p
keyword: freq=noraman
keyword: PBEPBE/SDD
title: #p freq=noraman PBEPBE/SDD
converged: YES YES NO NO
title: Mulliken charges:
elementType: O O O N N C C C C C C C C C C C C C C C H H H H H H H H H H H H H H H H H H H H H H
charge: -0.255363 -0.286474 -0.312019 -0.160572 -0.469586 -0.478264 -0.307415 -0.321943 0.151656 -0.680923 -0.695883 0.338682 0.034482 -0.345714 -0.310950 -0.222372 -0.250382 0.219220 -0.256698 -0.664213 0.242474 0.237021 0.191562 0.207856 0.193813 0.220762 0.207658 0.246509 0.208962 0.212352 0.205622 0.254846 0.443708 0.314811 0.272974 0.231299 0.231974 0.223688 0.233273 0.218091 0.246381 0.229095
chargesum: 0.00000
title: Mulliken charges with hydrogens summed into heavy atoms:
elementType: O O O N N C C C C C C C C C C C C C C C
charge: -0.255363 -0.286474 -0.312019 -0.160572 -0.025878 0.001232 0.092003 0.092632 0.151656 -0.017794 -0.023063 0.338682 0.034482 -0.030903 -0.037976 0.008927 -0.018407 0.219220 0.200263 0.029354
polarizability: 2.38878917e+02 2.47318196e+00 2.28167528e+02 1.64127084e+00 6.49632216e+00 1.25323391e+02
1716.lowfreq: -7.1842 -0.0007 -0.0003 0.0004 3.5621 7.7791 18.3978 24.3834 36.2024
frequency: 17.9127 23.6527 35.8945 57.5301 61.5179 78.1549 80.5222 88.9174 98.9223 111.9318 128.2654 162.3143 185.4894 206.3448 229.3409 233.3712 261.7878 273.6008 283.3637 294.7790 317.9800 331.9834 379.2932 405.2511 411.0970 441.6662 447.6439 486.9923 506.1374 527.4499 537.4914 585.4591 644.0720 681.5422 682.3030 753.5790 758.1177 764.9451 788.0092 798.6567 806.7235 815.6128 834.0861 853.7950 900.1815 905.4287 933.4718 981.9342 987.6067 997.4203 999.2172 1011.2694 1017.3880 1043.1677 1050.6523 1070.8882 1081.5856 1094.2088 1095.2769 1117.9336 1128.8521 1154.0533 1164.9323 1172.3609 1183.7699 1208.1038 1228.2784 1255.6534 1257.1463 1279.1211 1283.3894 1290.9602 1299.2150 1336.4579 1355.1663 1364.9925 1371.6834 1381.5274 1390.0405 1390.2771 1396.0468 1435.4065 1444.5248 1449.1783 1455.7333 1463.7541 1469.6859 1473.5315 1474.9734 1480.2943 1483.9378 1489.0497 1496.3179 1504.4872 1569.2040 1579.7520 1613.6191 1620.9951 2870.4299 2879.7911 2935.2805 2981.9664 2986.5824 2992.3100 3016.0732 3030.7141 3036.8910 3050.5769 3074.5644 3078.2592 3087.9898 3092.2887 3095.1215 3096.3204 3118.3310 3134.8344 3156.7566 3173.6594 3182.0867 3186.5927
redmass: 3.8119 3.1548 3.3920 4.3410 3.9262 4.2981 4.3830 2.1318 2.0736 4.5408 2.6134 5.0907 2.3453 1.6023 1.3334 1.4700 3.2494 3.9463 3.8474 1.9335 2.5537 2.7349 6.2947 3.5795 3.8077 3.4541 3.0667 4.4800 4.4096 3.9543 3.8764 3.5618 5.8873 4.9348 4.9754 2.6376 2.6666 2.7325 1.7172 1.1457 1.2676 1.5073 3.8426 4.4151 2.0056 1.3951 5.5082 1.3647 1.9093 2.0907 2.8264 1.3122 1.1739 3.5224 2.8444 2.3974 2.0467 1.9694 2.1384 1.8080 1.8362 1.6767 1.7065 1.3949 1.6288 2.2806 2.6018 1.3487 2.2635 1.1275 1.2400 1.2345 1.7206 1.4096 1.3461 1.3542 1.4112 5.8649 1.2322 1.2328 1.2294 2.3806 1.3068 1.7190 1.1301 1.0443 1.0584 1.0571 1.0747 1.0723 1.0532 1.0631 1.1367 2.2630 5.1991 7.5645 6.4714 6.3951 1.0714 1.0719 1.0678 1.0360 1.0359 1.0360 1.0887 1.0592 1.0912 1.0892 1.0981 1.0969 1.0973 1.1032 1.1006 1.1005 1.1063 1.0873 1.0929 1.0794 1.0946 1.0968
irintensity: 0.2991 0.0210 0.0899 0.5973 2.5342 4.1598 1.0577 1.9671 0.8870 0.6053 0.2176 0.4511 2.4461 5.4992 5.0867 1.5863 4.9843 5.7785 1.1707 1.8945 5.5785 16.1870 3.8109 2.0814 12.2812 5.4314 0.6173 12.5632 0.5548 10.3932 15.8479 1.4371 7.6309 8.2226 16.2206 19.4407 4.9191 37.8509 40.0849 3.5076 4.5123 0.4983 1.9780 4.7043 3.8947 4.0399 1.2190 3.5904 7.1952 20.8152 1.3508 3.4677 62.0802 136.1664 165.1849 18.6370 27.3431 18.6542 24.0123 18.4360 50.8774 56.4504 13.2982 5.3596 4.9367 26.8246 269.1436 17.5760 264.3932 0.4800 15.3007 26.3576 51.2629 3.3198 13.7243 4.8549 28.2702 37.6503 27.3806 11.6857 26.8992 20.9858 83.3227 72.2868 17.7472 9.9531 1.9875 12.7877 10.6858 2.4891 9.7875 12.5593 38.3787 583.5896 130.2649 123.9220 142.2951 137.2728 49.7889 188.5125 61.6960 27.7140 27.1261 21.1304 16.4743 35.4853 8.7571 6.4707 29.6128 77.4711 40.1607 0.8056 25.2759 31.8548 33.7265 9.6205 21.7718 244.7196 2.1617 18.4191
temp: 298.150 k
press: 1.00000 atm
elementType: 8 8 8 7 7 6 6 6 6 6 6 6 6 6 6 6 6 6 6 6 1 1 1 1 1 1 1 1 1 1 1 1 1 1 1 1 1 1 1 1 1 1
symmnumber: 1
zpe: 917625.6 jmol-1
zpe.correction: 0.349505 hartree
zpe.thermalcorrener: 0.370932 hartree
zpe.thermalcorrenthalpy: 0.371876 hartree
zpe.thermalcorrgfe: 0.296892 hartree
zpe.sumelectzpe: -918.463227 hartree
zpe.sumelectthermal: -918.441800 hartree
zpe.sumelectthermalent: -918.440856 hartree
zpe.sumelectthermalfe: -918.515840 hartree
dipole: -0.4789 4.1306 -0.0180
dipole: 4.1583
quadrupole: -105.2050 -120.1542 -120.0985
quadrupole: 3.7042 0.6521 0.2234
quadrupole: 9.9476 -5.0016 -4.9459 3.7042 0.6521 0.2234
hfenergy: -918.812732 hartree
pointgroup: C01 [X(C15H22N2O3)]
dipole: -0.3567284 1.1333634 -1.1246094 debye
polarizability: 232.0324165|18.5229527|193.252479|17.885642|-47.4478823|167.0849408 unknown
InChI: InChI=1S/C15H22N2O3/c1-4-17(5-2)11-14(18)16-13-10-8-7-9-12(13)15(19)20-6-3/h7-10,16H,4-6,11H2,1-3H3
charge 0 multiplicity 1
42 atoms
O  1.946418 -2.146504 2.563937
O  -2.644044 1.076672 -0.90714
O  -0.36995 1.226427 -0.448004
N  2.900968 0.686772 0.413362
N  0.697253 -0.684166 1.17065
C  3.057684 -0.19469 1.585584
C  3.417087 2.06822 0.608333
C  3.342748 0.024314 -0.847104
C  1.846332 -1.126017 1.817609
C  2.511723 2.91106 1.527008
C  2.775402 0.6836 -2.118522
C  -0.595333 -1.245263 1.205205
C  -1.678785 -0.621602 0.484524
C  -0.864389 -2.43279 1.948282
C  -2.976038 -1.205086 0.532657
C  -2.157854 -2.983015 1.974265
C  -3.22467 -2.375318 1.2672
C  -1.471804 0.614472 -0.305811
C  -2.52304 2.304312 -1.750178
C  -2.105793 1.944551 -3.17919
H  3.160887 0.415024 2.502941
H  3.958373 -0.846532 1.539449
H  4.46392 2.060199 1.000783
H  3.454834 2.551669 -0.382932
H  4.45868 -0.027139 -0.906709
H  2.982254 -1.021302 -0.802035
H  2.444939 2.489099 2.546857
H  1.491879 2.956476 1.107424
H  2.908747 3.939111 1.619789
H  3.008089 0.059448 -3.000875
H  3.205001 1.685007 -2.301184
H  1.680339 0.789999 -2.030936
H  0.850629 0.172628 0.592149
H  -0.041733 -2.898129 2.494279
H  -3.778838 -0.712854 -0.021668
H  -2.334252 -3.896321 2.553777
H  -4.229199 -2.809359 1.291796
H  -3.533932 2.740856 -1.712158
H  -1.794028 2.985953 -1.278517
H  -2.115954 2.853185 -3.809613
H  -1.085872 1.525174 -3.196562
H  -2.80238 1.210856 -3.620126
