program: Gaussian 09
title: 000198564
version: EM64L-G09RevD.01
frameworkgroup: C1[X(C10H16N2S4)]
method: RPBEPBE
basis: SDD
operation: Freq
keyword: #p
keyword: freq=noraman
keyword: PBEPBE/SDD
title: #p freq=noraman PBEPBE/SDD
converged: NO YES NO NO
title: Mulliken charges:
elementType: S S S S N N C C C C C C C C C C H H H H H H H H H H H H H H H H
charge: 0.415330 0.415330 0.415330 0.415328 -0.030536 -0.030537 -0.395780 -0.395794 -0.395790 -0.395784 -0.379495 -0.379494 -0.581306 -0.581309 -0.581306 -0.581308 0.296431 0.296965 0.296432 0.296967 0.296431 0.296965 0.296432 0.296967 0.341295 0.332087 0.341295 0.332087 0.341296 0.332087 0.341294 0.332087
chargesum: 2.00000
title: Mulliken charges with hydrogens summed into heavy atoms:
elementType: S S S S N N C C C C C C C C C C
charge: 0.415330 0.415330 0.415330 0.415328 -0.030536 -0.030537 0.197617 0.197604 0.197606 0.197615 -0.379495 -0.379494 0.092077 0.092073 0.092077 0.092074
polarizability: 2.99399132e+02 -7.52871955e-04 1.67018851e+02 -1.51924579e-03 7.98135313e-06 1.08243890e+02
1716.lowfreq: -6.1742 -0.0016 0.0013 0.0033 2.4251 4.8928 20.1982 52.7874 63.3145
frequency: 20.0051 52.7874 63.2829 96.9820 103.0191 113.8332 144.1181 160.8490 171.2299 220.7800 221.0639 253.3145 271.3204 325.3533 353.1415 356.9010 400.8472 432.9732 438.9165 442.0462 463.8683 486.2166 549.9367 559.9305 575.3102 587.2654 589.6866 606.0856 606.1619 608.4814 797.2987 848.5127 850.1489 850.2280 851.0742 868.8248 923.9657 959.1367 959.6638 993.8061 1012.2938 1012.5466 1015.7267 1037.5830 1064.6515 1075.0880 1121.0937 1122.0327 1134.5513 1171.2394 1171.5851 1174.3385 1215.5182 1247.9199 1273.5684 1282.2137 1286.6857 1291.9880 1305.0489 1305.6423 1359.7912 1372.9148 1375.1957 1377.5717 1430.9663 1430.9677 1437.1961 1437.2144 1454.2822 1458.7068 1467.8856 1474.4334 1496.2147 1498.3923 3002.6581 3007.8486 3008.1234 3008.5853 3054.5950 3054.6000 3057.3561 3057.3812 3067.7421 3068.9685 3074.6206 3079.7532 3137.7523 3137.7593 3152.4731 3152.4773
redmass: 4.5107 11.4516 4.1852 5.8522 3.2923 4.3220 3.8784 5.9812 10.1334 2.0577 2.0828 3.3255 1.7948 3.9175 5.9703 4.0094 5.6901 4.0620 3.9351 18.3774 13.4794 3.4592 7.4528 8.3535 6.8644 5.9985 7.3965 3.5841 3.6026 1.9421 5.2053 1.5890 1.5431 1.5435 4.5110 4.9971 8.5505 1.4527 1.4704 2.3547 2.5313 2.5466 2.6594 1.7847 2.4902 2.3203 1.1246 1.0435 4.4138 1.2952 1.2960 4.4596 1.0878 1.2314 1.1454 1.1858 1.2629 1.2359 1.1827 1.1821 1.2296 1.4265 1.2812 1.3174 1.0801 1.0801 1.0981 1.0979 1.1968 1.0759 1.1116 1.0787 5.9882 4.7795 1.0625 1.0598 1.0636 1.0582 1.0559 1.0559 1.0599 1.0599 1.1031 1.1031 1.1059 1.1075 1.1109 1.1110 1.1102 1.1102
irintensity: 0.1270 0.0000 0.2207 0.1592 0.2675 13.9906 2.3382 2.6841 0.0000 3.3732 0.0000 9.0897 0.0000 6.4077 0.3586 3.4028 1.7622 0.5426 1.1100 0.0000 24.3412 0.4458 0.0065 0.8283 0.0000 48.7240 0.0000 0.1400 0.0782 3.2070 0.0000 0.0269 1.3480 17.8589 5.8009 43.2435 3.1704 0.0000 1.5532 85.9151 0.0001 10.1264 14.9122 0.0000 0.0000 1.8813 2.4615 0.0025 48.9932 68.6061 0.0001 4.9987 77.7159 11.4840 0.0000 46.2931 2.4628 11.4200 38.6402 0.0000 0.5671 0.0000 39.8083 4.3492 16.3275 42.5658 6.7100 0.0010 295.1834 25.5424 0.0000 27.4609 0.0000 562.3610 0.3961 2.7679 0.0002 2.4984 3.0748 2.0257 7.3850 0.0369 0.4512 0.0000 0.0004 2.6743 8.3475 0.6481 2.1481 2.2479
temp: 298.150 k
press: 1.00000 atm
elementType: 16 16 16 16 7 7 6 6 6 6 6 6 6 6 6 6 1 1 1 1 1 1 1 1 1 1 1 1 1 1 1 1
symmnumber: 1
zpe: 668079.1 jmol-1
zpe.correction: 0.254458 hartree
zpe.thermalcorrener: 0.271035 hartree
zpe.thermalcorrenthalpy: 0.271979 hartree
zpe.thermalcorrgfe: 0.208865 hartree
zpe.sumelectzpe: -2090.603804 hartree
zpe.sumelectthermal: -2090.587226 hartree
zpe.sumelectthermalent: -2090.586282 hartree
zpe.sumelectthermalfe: -2090.649396 hartree
dipole: 0.0000 0.0000 0.0000
dipole: 0.0001
quadrupole: 60.5533 -102.1478 -116.6593
quadrupole: 0.0001 -0.0009 0.0000
quadrupole: 113.3045 -49.3965 -63.9080 0.0001 -0.0009 0.0000
hfenergy: -2090.8582615 hartree
pointgroup: C01 [X(C10H16N2S4)]
dipole: 0.0000002 0.000019 -0.0000065 debye
polarizability: 299.3991034|-0.0011946|167.0188508|-0.0736752|-0.0002262|108.2439182 unknown
InChI: InChI=1S/C10H16N2S4/c1-2-12(10-15-7-8-16-10)4-3-11(1)9-13-5-6-14-9/h1-8H2
charge 2 multiplicity 1
32 atoms
S  3.751629 -1.417762 0.579702
S  3.751126 1.416941 -0.582828
S  -3.751882 -1.417747 -0.579834
S  -3.751435 1.416966 0.582673
N  1.477278 -0.000422 -0.000616
N  -1.477559 -0.00042 0.000605
C  0.679843 1.215369 -0.359925
C  0.680149 -1.216203 0.359394
C  -0.680124 1.215356 0.359959
C  -0.68043 -1.216221 -0.359346
C  2.824487 -0.000418 -0.001179
C  -2.824768 -0.000401 0.001086
C  5.423609 -0.760204 -0.080368
C  5.423647 0.759433 0.075913
C  -5.423898 -0.760176 0.080134
C  -5.423922 0.759459 -0.076159
H  0.548995 1.257996 -1.457505
H  1.235216 2.117639 -0.047181
H  0.550225 -1.258804 1.457085
H  1.235255 -2.118484 0.046208
H  -0.549277 1.257943 1.45754
H  -1.235494 2.117639 0.047248
H  -0.550505 -1.258875 -1.457034
H  -1.235538 -2.118484 -0.046113
H  5.511566 -1.093959 -1.124618
H  6.199249 -1.228688 0.54682
H  5.512418 1.09319 1.120093
H  6.198777 1.227941 -0.551889
H  -5.511915 -1.093922 1.124381
H  -6.199504 -1.228663 -0.547094
H  -5.512632 1.093208 -1.120347
H  -6.199085 1.227974 0.551595
