program: Gaussian 09
title: 000198562
version: EM64L-G09RevD.01
frameworkgroup: C1[X(C15H15N)]
method: RPBEPBE
basis: SDD
operation: Freq
keyword: #pfreq=noraman
keyword: PBEPBE/SDD
title: #p freq=noraman PBEPBE/SDD
converged: YES YES NO NO
title: Mulliken charges:
elementType: N C C C C C C C C C C C C C C C H H H H H H H H H H H H H H H
charge: -0.691013 0.316080 0.551208 -0.606472 0.319585 -0.410282 -0.420226 -0.338311 -0.846475 0.500550 -0.342720 -0.398905 -0.413855 -0.238473 -0.239871 -0.252646 0.223981 0.222066 0.212703 0.214203 0.224043 0.224694 0.240126 0.209985 0.219509 0.222927 0.323570 0.305630 0.220564 0.222086 0.225740
chargesum: 0.00000
title: Mulliken charges with hydrogens summed into heavy atoms:
elementType: N C C C C C C C C C C C C C C C
charge: -0.061814 0.316080 0.551208 -0.382491 0.319585 -0.188216 -0.207523 -0.124107 -0.157612 0.500550 -0.132734 -0.179396 -0.190928 -0.017910 -0.017786 -0.026906
polarizability: 4.12784922e+02 2.79728006e+00 1.67845753e+02 6.93814564e-03 2.17579457e-02 7.15055611e+01
1716.lowfreq: -5.7774 -0.0008 -0.0006 0.0003 4.2842 16.9503 28.2634 48.1816 64.3900
frequency: 28.2082 48.1784 64.3898 94.2824 154.7718 183.5260 185.4803 225.5147 234.9872 257.4551 304.9919 332.6886 361.0336 394.0031 398.7895 405.0273 443.4881 479.3065 499.5205 509.3369 551.3268 582.1800 615.8860 625.8872 694.9459 739.2052 743.8690 766.8964 787.7666 816.7516 841.3052 851.9677 864.0919 903.2042 920.6350 933.7072 944.7264 973.2676 975.2622 985.5067 988.1830 992.1282 1024.9837 1027.1472 1044.2831 1081.8610 1148.9462 1170.2408 1180.2041 1191.3532 1220.0506 1247.4912 1285.9034 1302.1890 1316.8446 1330.8372 1340.3931 1380.2008 1390.5390 1401.6009 1427.1348 1441.9653 1474.7191 1482.9811 1486.1419 1520.7711 1575.8737 1580.3911 1604.8658 1626.1100 1637.5137 1647.2271 2951.2284 3017.8255 3083.1054 3085.1229 3094.4065 3106.8056 3112.5917 3113.2339 3121.2127 3134.7569 3144.7707 3146.4168 3161.9611 3568.6239 3708.3790
redmass: 3.5741 4.7969 4.4291 3.7420 2.7623 1.0855 5.4390 2.2283 4.3843 3.4355 2.8882 1.1541 3.4843 3.5406 1.1598 2.7814 2.8248 4.5929 2.9223 4.3931 4.6013 2.8957 6.4173 6.2127 1.6911 2.8932 5.4683 1.9168 4.3275 1.5036 1.3041 4.2114 1.5887 1.4551 1.7142 3.3666 1.3738 1.3759 1.1876 3.6973 1.9773 1.2859 1.7777 1.7229 1.5164 1.6271 1.5909 1.0741 1.4617 1.1164 2.8555 1.4169 2.0722 1.5296 1.3721 2.4296 1.6076 4.5808 2.7209 1.6170 3.1264 2.3437 1.0448 1.5921 1.6548 3.0808 6.3551 5.7639 5.7099 3.2732 1.9726 2.5700 1.0395 1.0975 1.0907 1.0951 1.0862 1.0906 1.0867 1.0874 1.0855 1.0913 1.0955 1.0950 1.1013 1.0449 1.1037
irintensity: 0.0609 2.2142 0.5970 0.1000 0.3288 1.3668 0.2390 0.6713 0.1053 0.7337 1.1138 234.2180 2.7760 4.7117 59.4934 0.7479 1.3268 7.8252 6.8223 19.5058 3.4534 12.9484 0.0095 0.1010 50.7105 14.5256 0.2700 29.1817 2.2570 49.3966 0.0046 0.1869 5.5246 4.8448 0.3669 1.6040 4.5600 1.0214 49.3201 0.1961 8.1208 11.3533 2.8553 15.6441 7.7131 10.0161 41.4896 0.2266 2.3516 2.5349 21.0062 19.5836 0.9899 7.0987 5.4444 82.1244 62.6779 9.0515 2.0608 10.4030 44.5199 3.8387 13.5622 15.4397 9.8992 169.9586 50.3259 7.9047 161.5736 22.9707 244.7629 128.7585 61.5736 28.6408 1.1978 11.1388 41.4058 28.3455 29.3767 5.5814 2.3141 12.1984 45.0564 21.5121 40.5092 139.7600 23.2024
temp: 298.150 k
press: 1.00000 atm
elementType: 7 6 6 6 6 6 6 6 6 6 6 6 6 6 6 6 1 1 1 1 1 1 1 1 1 1 1 1 1 1 1
symmnumber: 1
zpe: 668981.0 jmol-1
zpe.correction: 0.254801 hartree
zpe.thermalcorrener: 0.269395 hartree
zpe.thermalcorrenthalpy: 0.270339 hartree
zpe.thermalcorrgfe: 0.212611 hartree
zpe.sumelectzpe: -634.227967 hartree
zpe.sumelectthermal: -634.213374 hartree
zpe.sumelectthermalent: -634.212430 hartree
zpe.sumelectthermalfe: -634.270158 hartree
dipole: -4.0454 -0.2078 -0.0107
dipole: 4.0508
quadrupole: -64.2739 -80.8905 -104.5617
quadrupole: 2.3475 0.0781 0.0168
quadrupole: 18.9681 2.3516 -21.3197 2.3475 0.0781 0.0168
hfenergy: -634.4827686 hartree
pointgroup: C01 [X(C15H15N1)]
dipole: 1.5916207 0.0809778 0.0078911 debye
polarizability: 412.7713767|2.658069|167.8224198|2.3681518|1.4217365|71.5424392 unknown
InChI: InChI=1S/C15H15N/c1-12-11-14(9-10-15(12)16)8-7-13-5-3-2-4-6-13/h2-11H,16H2,1H3
charge 0 multiplicity 1
31 atoms
N  5.428071 0.80781 0.075788
C  3.58561 -0.817424 0.038456
C  1.232899 0.010065 0.035935
C  2.195482 -1.042024 0.026464
C  4.058741 0.534944 0.061746
C  1.734283 1.345132 0.059229
C  3.112281 1.60199 0.071842
C  -0.194336 -0.326453 0.021591
C  4.573436 -1.969689 0.027851
C  -2.683281 0.195191 0.009519
C  -1.254775 0.545704 0.023649
C  -3.167884 -1.147933 -0.013419
C  -3.649832 1.24477 0.018864
C  -4.549361 -1.421443 -0.025626
C  -5.033461 0.97164 0.006605
C  -5.493982 -0.36525 -0.015676
H  1.835666 -2.079971 0.008739
H  1.039633 2.192227 0.067834
H  3.474277 2.638029 0.090001
H  -0.407999 -1.405477 0.007968
H  5.238168 -1.93665 -0.85971
H  5.221638 -1.966864 0.928107
H  4.049111 -2.939443 0.006261
H  -1.04791 1.62557 0.037832
H  -2.459934 -1.984204 -0.022204
H  -3.301649 2.285635 0.036348
H  6.113131 0.05907 0.065489
H  5.763007 1.766626 0.089375
H  -4.895982 -2.461434 -0.043487
H  -5.752046 1.799313 0.014455
H  -6.567804 -0.582557 -0.025427
