program: Gaussian 09
title: 000198561
version: EM64L-G09RevD.01
frameworkgroup: C1[X(C15H15N)]
method: RPBEPBE
basis: SDD
operation: Freq
keyword: #pfreq=noraman
keyword: PBEPBE/SDD
title: #p freq=noraman PBEPBE/SDD
converged: YES YES NO NO
title: Mulliken charges:
elementType: N C C C C C C C C C C C C C C C H H H H H H H H H H H H H H H
charge: -0.696886 0.385845 0.333391 -0.642198 -0.388812 -0.324701 0.532540 -0.467993 -0.848040 -0.338676 0.494692 -0.401173 -0.414926 -0.238708 -0.240744 -0.253041 0.218726 0.218483 0.225870 0.216747 0.229964 0.234851 0.233274 0.207558 0.218490 0.223040 0.220619 0.222343 0.306657 0.306881 0.225925
chargesum: 0.00000
title: Mulliken charges with hydrogens summed into heavy atoms:
elementType: N C C C C C C C C C C C C C C C
charge: -0.083348 0.385845 0.333391 -0.423472 -0.170329 -0.098831 0.532540 -0.251246 -0.149951 -0.131118 0.494692 -0.182682 -0.191885 -0.018088 -0.018401 -0.027116
polarizability: 4.07891537e+02 2.16664512e+00 1.71279426e+02 1.79487824e-01 -7.51777640e-01 7.13947886e+01
1716.lowfreq: -7.7994 -0.5647 -0.0006 -0.0002 0.0004 11.5800 17.4126 46.4652 65.9436
frequency: 17.0659 46.4640 65.9379 83.4033 157.6564 183.4101 186.5649 216.4706 237.8959 246.6517 308.9355 358.6400 376.2086 383.2085 404.0369 417.1844 443.1712 476.1600 503.5379 510.7691 552.6237 588.1383 611.5558 617.5434 693.9346 724.2767 733.8133 768.9480 797.6219 815.2907 840.6093 860.7284 863.3852 873.0051 916.6229 941.5038 947.3364 972.3738 974.5496 985.6778 991.5428 991.6954 1025.1163 1041.2923 1049.2909 1082.6675 1104.7774 1170.4043 1187.9375 1191.0233 1210.3756 1243.5777 1287.2053 1295.0322 1322.8511 1338.9193 1341.9772 1380.5982 1390.4999 1399.1703 1439.3088 1449.6684 1474.8391 1479.5384 1486.9032 1511.3245 1568.8690 1578.6887 1604.0995 1626.5714 1639.0550 1647.8887 2974.5801 3051.3258 3082.6622 3090.0017 3109.4617 3113.9017 3116.8812 3118.4561 3122.1242 3135.0763 3144.5336 3147.0269 3162.1777 3564.7748 3705.4570
redmass: 3.4662 4.8504 4.3794 3.4756 1.9242 1.6316 5.0260 1.8604 4.1987 3.2262 2.9102 2.0941 1.6859 1.0304 2.8176 3.5075 2.6128 4.3535 4.6173 3.1251 4.9898 2.8370 5.8535 6.1424 1.7167 5.7584 2.3215 2.0007 4.7760 1.4755 1.2981 3.8712 1.5758 1.7671 1.6345 3.1425 1.3858 1.3720 1.1777 6.0502 1.5128 1.2874 2.2068 1.5639 1.4758 1.6299 2.1581 1.0650 1.4476 1.1337 2.2613 1.3564 2.2680 1.7501 1.4333 1.3102 2.7200 5.0459 2.8041 1.5172 2.3262 2.5109 1.0465 2.0373 1.6055 2.6092 6.3385 5.5087 5.5961 4.9583 1.5420 2.7617 1.0375 1.0975 1.0982 1.0893 1.0908 1.0865 1.0868 1.0869 1.0856 1.0910 1.0957 1.0952 1.1014 1.0448 1.1040
irintensity: 0.0068 1.8914 0.4971 0.0184 0.4252 3.5119 0.3626 4.0510 0.2600 0.7883 2.5158 89.4116 221.5275 0.9405 0.1782 4.7671 0.9425 10.4550 15.0544 16.4712 2.9168 5.9718 0.7813 0.2473 49.5950 1.0226 6.9255 37.9273 0.3716 42.9289 0.0856 0.4765 32.1185 0.8519 1.3039 1.6050 7.0874 0.9717 40.7072 2.5216 3.4525 9.5987 7.9967 9.9617 4.3876 8.0631 21.5312 0.0536 1.8185 3.4282 0.3717 26.2926 45.4381 23.3154 34.3576 17.5975 119.7772 0.2122 0.1070 20.5048 4.2374 4.8434 12.9771 12.3790 6.2679 110.2435 12.3612 11.1664 240.4920 176.5238 81.4303 282.8685 25.6545 19.7021 21.2188 16.0758 42.2650 8.6595 56.8925 3.6115 3.7069 7.6249 47.9976 26.0606 41.0918 151.6787 20.4032
temp: 298.150 k
press: 1.00000 atm
elementType: 7 6 6 6 6 6 6 6 6 6 6 6 6 6 6 6 1 1 1 1 1 1 1 1 1 1 1 1 1 1 1
symmnumber: 1
zpe: 669275.1 jmol-1
zpe.correction: 0.254913 hartree
zpe.thermalcorrener: 0.269527 hartree
zpe.thermalcorrenthalpy: 0.270472 hartree
zpe.thermalcorrgfe: 0.212212 hartree
zpe.sumelectzpe: -634.225809 hartree
zpe.sumelectthermal: -634.211195 hartree
zpe.sumelectthermalent: -634.210251 hartree
zpe.sumelectthermalfe: -634.268511 hartree
dipole: -3.6258 -0.0453 -0.0003
dipole: 3.6261
quadrupole: -64.6000 -80.8317 -104.5327
quadrupole: 2.6829 -0.0107 -0.1503
quadrupole: 18.7215 2.4898 -21.2112 2.6829 -0.0107 -0.1503
hfenergy: -634.4807228 hartree
pointgroup: C01 [X(C15H15N1)]
dipole: 1.4262173 -0.0232965 0.0233952 debye
polarizability: 407.7303905|-4.9223513|168.7920361|5.4754892|15.7208293|74.0433245 unknown
InChI: InChI=1S/C15H15N/c1-12-11-15(16)10-9-14(12)8-7-13-5-3-2-4-6-13/h2-11H,16H2,1H3
charge 0 multiplicity 1
31 atoms
N  5.620561 0.557036 0.241701
C  1.398322 -0.090545 0.057342
C  2.317521 -1.190041 -0.069861
C  3.706471 -0.955372 -0.005786
C  1.953037 1.211482 0.243395
C  -0.05032 -0.318141 -0.00595
C  4.242476 0.349789 0.182138
C  3.333466 1.441119 0.306375
C  1.828542 -2.616792 -0.271801
C  -1.046578 0.617323 0.13769
C  -2.495752 0.375709 0.066034
C  -3.075819 -0.903202 -0.194593
C  -3.384843 1.474096 0.264847
C  -4.473208 -1.069128 -0.250326
C  -4.784165 1.308835 0.20901
C  -5.339466 0.034142 -0.049088
H  4.395285 -1.804706 -0.10362
H  1.280988 2.071291 0.337863
H  -0.355204 -1.356574 -0.186146
H  3.718555 2.45841 0.448758
H  2.678392 -3.316879 -0.337894
H  1.18429 -2.951496 0.563005
H  1.238836 -2.720262 -1.202386
H  -0.769191 1.663632 0.330178
H  -2.43029 -1.773635 -0.357264
H  -2.963062 2.467302 0.465889
H  -4.893708 -2.061279 -0.452378
H  -5.441391 2.171799 0.366221
H  6.26928 -0.219316 0.152058
H  6.00103 1.48927 0.374942
H  -6.425958 -0.099664 -0.093755
