program: Gaussian 09
title: 000198558
version: EM64L-G09RevD.01
frameworkgroup: C1[X(C14H12Cl2N2)]
method: RPBEPBE
basis: SDD
operation: Freq
keyword: #p
keyword: freq=noraman
keyword: PBEPBE/SDD
title: #p freq=noraman PBEPBE/SDD
converged: YES YES NO NO
title: Mulliken charges:
elementType: Cl Cl N N C C C C C C C C C C C C C C H H H H H H H H H H H H
charge: -0.087105 -0.087106 -0.677242 -0.677242 0.571805 0.571804 -0.349051 -0.349049 -0.436046 -0.436045 -0.408962 -0.408963 0.580650 0.580649 -0.337344 -0.337343 -0.393581 -0.393581 0.215756 0.215755 0.248755 0.248755 0.223367 0.223368 0.219807 0.219808 0.319130 0.310060 0.319130 0.310060
chargesum: 0.00000
title: Mulliken charges with hydrogens summed into heavy atoms:
elementType: Cl Cl N N C C C C C C C C C C C C C C
charge: -0.087105 -0.087106 -0.048053 -0.048052 0.571805 0.571804 -0.133296 -0.133294 -0.187290 -0.187290 -0.185595 -0.185595 0.580650 0.580649 -0.337344 -0.337343 -0.173773 -0.173773
polarizability: 4.93730538e+02 -2.28488686e+01 1.92135737e+02 2.78968800e-04 2.38796495e-04 7.08215959e+01
1716.lowfreq: -4.6233 0.0018 0.0021 0.0025 3.5872 9.4028 16.2797 40.6271 45.3885
frequency: 16.2797 40.6271 45.3885 82.4975 142.7918 143.6924 148.0514 171.8088 213.2945 220.8969 235.2049 267.6671 320.3091 332.0047 372.0037 372.6346 375.7234 386.4061 429.1889 430.2897 431.1126 457.6763 458.6729 460.1491 475.7184 509.2942 557.8107 599.2736 606.3610 676.0984 688.8416 721.8592 730.3499 793.1212 812.3248 813.8184 815.7376 842.2897 877.3044 877.4542 886.8086 904.3165 942.8067 946.3519 974.4749 1011.9785 1013.1438 1038.3379 1040.0275 1159.7840 1165.4885 1199.1949 1231.5354 1280.2384 1281.3573 1296.5821 1318.9804 1332.9171 1345.2039 1369.2385 1387.8355 1430.7105 1435.4776 1509.8999 1522.3266 1547.1307 1551.6761 1611.1925 1616.8949 1630.3504 1643.1866 1651.7389 3087.7455 3097.9361 3122.6235 3122.6567 3146.2362 3146.5272 3152.2571 3152.4188 3552.1495 3552.9737 3700.4312 3700.4359
redmass: 8.6765 5.1058 7.2971 4.7213 3.9636 4.5986 14.3008 6.2639 2.6506 5.5849 7.1355 5.2577 5.8488 2.8448 1.2291 7.6715 1.2425 3.6630 5.2611 2.8390 2.7392 1.1584 1.1656 3.4322 6.8318 3.7542 3.2256 3.3974 6.8269 7.6991 7.7561 3.4176 3.2222 5.2154 1.4937 1.5388 4.6245 1.5739 5.9585 1.5192 4.6913 1.9011 1.3673 1.3981 1.1451 2.2129 2.1375 1.8114 1.7775 1.2219 1.2085 2.1770 1.3593 1.7090 1.7792 1.5737 1.6647 1.7242 4.0997 3.8299 3.2245 5.8335 4.7946 3.4156 3.5930 6.7197 6.1555 2.0479 1.4919 2.1371 3.1536 4.3254 1.0913 1.0858 1.0875 1.0875 1.0921 1.0919 1.0955 1.0953 1.0451 1.0454 1.1036 1.1036
irintensity: 0.8092 3.7210 1.4543 0.0000 0.0001 0.0039 0.0000 0.0000 0.0003 12.9889 3.2957 0.0001 8.6227 0.0043 315.1462 1.3282 0.0547 22.2724 1.6057 37.8206 0.0011 0.0198 245.0962 1.5782 58.1269 3.5248 0.0001 11.5792 0.0002 45.1122 0.0002 0.0000 9.5062 43.1485 0.0003 79.5123 0.0624 0.0000 49.0980 25.5203 0.0007 0.0000 10.3161 0.0000 61.6731 0.0001 9.3700 97.4472 0.0001 57.2499 0.0000 0.0000 52.5123 4.5995 0.0000 3.1709 0.0000 0.0000 255.2091 0.0001 32.8018 0.0000 4.4539 0.0000 460.7951 0.0000 20.9995 0.0007 63.6824 0.0003 867.9277 0.0001 0.0000 57.3048 34.1622 1.4757 0.0001 15.8561 23.8191 0.0231 392.0070 0.0030 8.2621 61.4547
temp: 298.150 k
press: 1.00000 atm
elementType: 17 17 7 7 6 6 6 6 6 6 6 6 6 6 6 6 6 6 1 1 1 1 1 1 1 1 1 1 1 1
symmnumber: 1
zpe: 590737.6 jmol-1
zpe.correction: 0.225000 hartree
zpe.thermalcorrener: 0.241997 hartree
zpe.thermalcorrenthalpy: 0.242941 hartree
zpe.thermalcorrgfe: 0.178731 hartree
zpe.sumelectzpe: -1569.060988 hartree
zpe.sumelectthermal: -1569.043991 hartree
zpe.sumelectthermalent: -1569.043047 hartree
zpe.sumelectthermalfe: -1569.107257 hartree
dipole: 0.0000 0.0000 -0.0124
dipole: 0.0124
quadrupole: -87.8395 -102.1768 -128.6693
quadrupole: -29.2019 -0.0002 0.0001
quadrupole: 18.3890 4.0518 -22.4408 -29.2019 -0.0002 0.0001
hfenergy: -1569.2859879 hartree
pointgroup: C01 [X(C14H12Cl2N2)]
dipole: -0.0000071 -0.0000062 0.0048677 debye
polarizability: 495.4417007|-1.7494225|190.4243234|0.0790288|0.1675126|70.8218461 unknown
InChI: InChI=1S/C14H12Cl2N2/c15-11-7-9(3-5-13(11)17)1-2-10-4-6-14(18)12(16)8-10/h1-8H,17-18H2
charge 0 multiplicity 1
30 atoms
Cl 5.562366 -2.071558 -0.094151
Cl -5.559914 2.070922 -0.090441
N  6.140115 0.92597 -0.093195
N  -6.137678 -0.926593 -0.098176
C  1.958605 -0.030344 -0.094556
C  -1.956162 0.029694 -0.095234
C  0.544424 -0.420476 -0.095075
C  -0.541981 0.419821 -0.094099
C  2.955719 -1.050149 -0.094842
C  -2.953271 1.049502 -0.093046
C  2.416321 1.322431 -0.093758
C  -2.413885 -1.323075 -0.098382
C  4.786036 0.621786 -0.09325
C  -4.783598 -0.62242 -0.096834
C  4.314787 -0.720559 -0.094019
C  -4.312341 0.719919 -0.093654
C  3.781807 1.639174 -0.09316
C  -3.779374 -1.639811 -0.099192
H  0.367785 -1.505631 -0.096282
H  -0.36534 1.504974 -0.092147
H  2.657542 -2.104193 -0.095491
H  -2.655088 2.103542 -0.090617
H  1.690964 2.14273 -0.093926
H  -1.688533 -2.143374 -0.100539
H  4.100906 2.688581 -0.092977
H  -4.098478 -2.689211 -0.102066
H  6.828565 0.176968 -0.092512
H  6.455226 1.891028 -0.088666
H  -6.826123 -0.177591 -0.095641
H  -6.452798 -1.891657 -0.096472
