program: Gaussian 09
title: 000198536
version: EM64L-G09RevD.01
frameworkgroup: C1[X(C9H11ClOS)]
method: RPBEPBE
basis: SDD
operation: Freq
keyword: #p
keyword: freq=noraman
keyword: PBEPBE/SDD
title: #p freq=noraman PBEPBE/SDD
converged: YES YES NO NO
title: Mulliken charges:
elementType: Cl S O C C C C C C C C C H H H H H H H H H H H
charge: -0.059449 0.200690 -0.426804 0.501728 -0.819601 -0.641186 -0.355436 -0.369787 -0.294870 -0.208387 -0.206677 -0.099102 0.259165 0.260653 0.246433 0.247354 0.242629 0.240049 0.234227 0.199208 0.255911 0.255661 0.337591
chargesum: 0.00000
title: Mulliken charges with hydrogens summed into heavy atoms:
elementType: Cl S O C C C C C C C C C
charge: -0.059449 0.200690 -0.089213 0.501728 -0.299783 -0.147400 -0.112807 -0.129738 0.138565 0.047524 0.048985 -0.099102
polarizability: 2.03671760e+02 -7.40632911e+00 1.03649730e+02 -1.52139511e+01 -9.20270612e+00 8.59282312e+01
1716.lowfreq: -9.2013 -0.0022 -0.0021 -0.0016 3.7153 7.4124 20.6726 34.4769 39.1039
frequency: 20.4433 34.3247 39.0674 46.8818 95.5147 143.7794 164.2700 233.3268 238.8639 302.9598 316.4941 352.6945 385.7722 407.2513 456.1313 498.7204 618.7645 626.6932 641.4532 658.0415 727.6262 801.3973 828.2041 830.9276 845.1011 894.9008 936.4980 951.2729 964.6990 988.1751 1000.3848 1057.2813 1072.3626 1089.0493 1101.9746 1135.0929 1183.8398 1201.9088 1222.0376 1242.8982 1292.5297 1295.7298 1318.8901 1379.5365 1384.7813 1395.8017 1443.0822 1459.5626 1463.5446 1478.4947 1587.3891 1601.2616 2941.9026 2988.8513 3010.7277 3053.7718 3081.1616 3088.4500 3136.3846 3138.5859 3170.7464 3174.3614 3560.3363
redmass: 4.5621 3.2777 8.2267 5.5204 6.1901 4.0764 7.2057 4.2725 2.5112 1.2635 5.1491 2.7070 8.8696 2.8749 3.1849 3.2747 5.1157 6.8558 5.2039 4.3670 3.1740 4.1188 1.2500 1.8124 2.0034 1.5256 2.2198 1.3681 1.3747 1.4099 4.2414 4.0230 2.7460 1.2599 1.0561 1.0914 1.1198 1.2152 2.4330 1.3236 1.2939 1.2696 1.2432 7.0896 1.2114 2.8336 1.0944 1.1127 1.0777 2.5172 7.3763 6.3365 1.0695 1.0581 1.0567 1.1045 1.1083 1.0950 1.0899 1.0899 1.0954 1.0963 1.0662
irintensity: 0.1588 5.0798 1.3158 1.1304 0.3772 1.8916 0.5013 0.8075 31.7755 177.7265 2.6328 0.7798 14.9570 0.0030 24.4317 22.1087 15.3677 0.1086 3.6648 11.0113 13.6884 12.1897 0.4001 37.2451 23.4861 1.6403 37.0235 0.5503 0.0171 26.7209 38.8577 29.4578 41.0952 13.8599 27.9830 6.4821 0.3299 1.3035 1.3410 37.0057 16.6399 0.1292 6.5395 0.1883 21.2220 4.7053 9.1880 4.6175 5.9370 79.1119 1.1824 14.7124 74.4429 60.3389 26.8375 17.8507 13.9629 25.1187 8.2939 9.5402 6.9178 0.6492 7.7884
temp: 298.150 k
press: 1.00000 atm
elementType: 17 16 8 6 6 6 6 6 6 6 6 6 1 1 1 1 1 1 1 1 1 1 1
symmnumber: 1
zpe: 465365.1 jmol-1
zpe.correction: 0.177248 hartree
zpe.thermalcorrener: 0.190356 hartree
zpe.thermalcorrenthalpy: 0.191300 hartree
zpe.thermalcorrgfe: 0.134152 hartree
zpe.sumelectzpe: -1281.978771 hartree
zpe.sumelectthermal: -1281.965663 hartree
zpe.sumelectthermalent: -1281.964719 hartree
zpe.sumelectthermalfe: -1282.021867 hartree
dipole: -2.3930 0.9225 3.9603
dipole: 4.7182
quadrupole: -90.3377 -77.4589 -89.6371
quadrupole: -1.5602 -13.0255 -5.1584
quadrupole: -4.5264 8.3523 -3.8259 -1.5602 -13.0255 -5.1584
hfenergy: -1282.1560195 hartree
pointgroup: C01 [X(C9H11Cl1O1S1)]
dipole: 0.8932537 -0.5206794 1.5416961 debye
dipolederiv: -0.8595953 0.1167838 -0.2084565 0.1344921 -0.1377537 0.0113955 -0.2444267 0.0119872 -0.1528332 -0.3735414 0.0114983 0.002439 0.0746937 -0.1289144 -0.0704723 -0.0498938 -0.0818115 -0.0265662 -0.7949037 -0.0778826 0.1130938 -0.1413621 -0.6027326 0.2681355 0.143461 0.2265325 -0.2458111 0.21043 -0.013881 0.0208427 -0.0645449 -0.0603848 0.0059041 0.1175538 0.0079199 -0.082143 0.3324686 0.0575067 -0.1042623 0.0658991 0.1465664 -0.0176801 -0.1436251 -0.0190226 0.1757586 0.2471462 -0.0596308 0.1663688 -0.1251591 0.0798531 0.0557159 0.3842017 0.1140941 0.0082409 0.0070808 -0.0726231 0.0261996 -0.0027295 0.0293019 0.0823962 0.0321705 0.0774755 -0.0785679 0.0029561 0.0147193 0.0785848 -0.0285805 0.0261958 0.0835895 0.0165223 0.0880857 -0.0714773 0.3809409 0.0546211 -0.0250804 0.0845834 0.5691557 -0.1580468 -0.2306965 -0.1416767 0.2945515 -0.3368378 0.0960349 -0.0152296 0.1297461 -0.0537754 0.0595719 -0.0215792 0.0709983 -0.0684011 -0.3363876 -0.0365892 -0.0905109 -0.0497243 -0.0078055 0.0394177 -0.1231965 0.0316935 -0.1164224 1.174226 -0.1988217 0.3588793 -0.2147858 0.1156224 0.0219586 0.3892457 0.0208321 0.0911572 -0.0335608 -0.013675 0.0019038 -0.0535869 0.0353386 -0.0799906 0.0277229 -0.0329844 -0.1189582 -0.0482688 0.0166489 0.0074454 0.0124612 -0.1177781 0.0804571 0.0597334 0.0336308 0.0337022 -0.0930468 -0.0081903 -0.0545969 0.0015233 -0.0057675 -0.1164992 -0.1186837 -0.0886059 -0.0895228 -0.0112321 -0.0355413 0.0071019 0.0241692 -0.1102127 0.102195 -0.032662 0.0968108 0.0238223 0.0422088 0.1006562 0.0002396 0.0920627 -0.0145034 -0.053113 0.0063833 -0.0479535 0.1110176 0.0396914 -0.0552417 -0.0872922 -0.0532182 0.0287841 -0.0776191 -0.0747086 -0.0845324 0.0646321 0.1248236 -0.0436778 -0.0307375 -0.0101403 -0.041797 -0.0577153 0.0217726 -0.0971088 -0.0291854 -0.2491485 0.0793617 -0.0877453 0.017584 -0.0052815 0.0683798 -0.057378 0.1042077 -0.0205221 0.0565828 -0.0404613 -0.0622556 -0.0361756 0.0512004 -0.0767084 -0.0679696 -0.0802597 0.096474 0.0559457 0.0747286 0.0017585 0.0775923 0.0133432 -0.0572442 -0.005113 -0.0537144 0.1339876 0.4620221 0.0336564 -0.0186902 0.0652 0.1913449 -0.1140278 -0.0288343 -0.1565981 0.0670667 unknown
polarizability: 202.44201|-11.3473718|102.3677339|17.4635909|10.0024822|88.4399772 unknown
InChI: InChI=1S/C9H11ClOS/c10-9-3-1-8(2-4-9)7-12-6-5-11/h1-4,11H,5-7H2
charge 0 multiplicity 1
23 atoms
Cl -4.954147 0.478007 -0.808359
S  2.053038 0.112279 -0.307292
O  5.003056 0.950018 -1.07104
C  -0.586671 -0.284901 0.581061
C  0.834264 -0.532814 1.024748
C  3.656673 -0.367286 0.58911
C  -1.263887 -1.229559 -0.232914
C  -1.268212 0.902195 0.953764
C  4.842405 -0.335627 -0.383278
C  -2.590832 -1.006391 -0.661075
C  -2.595761 1.144495 0.536054
C  -3.236674 0.181139 -0.266219
H  1.063346 -0.002342 1.964649
H  1.03684 -1.609918 1.154907
H  3.81062 0.327435 1.436814
H  3.533374 -1.391066 0.989303
H  -0.749705 -2.147308 -0.540225
H  -0.758416 1.648432 1.57385
H  4.693237 -1.064247 -1.196745
H  5.76792 -0.608366 0.171079
H  -3.109945 -1.73797 -1.286663
H  -3.117937 2.060113 0.827922
H  5.032113 1.680982 -0.402552
