program: Gaussian 09
title: 000198621
version: EM64L-G09RevD.01
frameworkgroup: C1[X(C17H16I2O4)]
method: RPBEPBE
basis: SDD
operation: Freq
keyword: #p
keyword: freq=noraman
keyword: PBEPBE/SDD
title: #p freq=noraman PBEPBE/SDD
converged: NO YES NO NO
title: Mulliken charges:
elementType: I I O O O O C C C C C C C C C C C C C C C C C H H H H H H H H H H H H H H H H
charge: 0.145747 0.142668 -0.286842 -0.442364 -0.406060 -0.228148 -0.232615 0.459864 -0.689287 -0.697086 -0.455804 0.069864 0.317486 -0.364695 -0.373263 0.518569 0.474696 -0.470541 -0.462859 -0.304698 -0.393711 -0.619167 0.214907 0.257886 0.213870 0.210507 0.229663 0.229283 0.212584 0.205840 0.252278 0.219095 0.256802 0.286843 0.258725 0.259130 0.254486 0.355155 0.381190
chargesum: 0.00000
title: Mulliken charges with hydrogens summed into heavy atoms:
elementType: I I O O O O C C C C C C C C C C C C C C C C C
charge: 0.145747 0.142668 -0.286842 -0.087210 -0.024870 -0.228148 0.025271 0.459864 -0.035246 -0.049378 -0.203526 0.069864 0.317486 -0.145600 -0.116461 0.518569 0.474696 -0.470541 -0.462859 -0.017855 -0.134986 -0.105550 0.214907
polarizability: 2.83532362e+02 1.65687317e-01 2.53846851e+02 -2.98899811e+01 5.56612842e+00 1.98236123e+02
1716.lowfreq: -24.6261 -7.7478 -6.0154 -4.7266 0.0001 0.0003 0.0006 7.2814 12.6876
frequency: -24.5081 1.3107 12.1039 15.1642 19.8202 25.9129 49.1378 73.6342 92.7115 107.7793 110.8379 142.2178 154.1395 169.1484 183.5876 197.4742 215.8438 223.9502 243.8643 254.7206 295.9159 301.4187 309.7739 335.2049 349.0383 363.9653 382.5821 401.2514 466.9315 469.0870 478.6819 494.0426 509.3170 520.2230 540.9302 551.0181 579.7554 592.8557 647.0313 661.9084 689.8951 706.8708 733.3442 735.3601 762.7932 792.1573 801.6097 841.0150 865.8384 873.7467 886.2140 892.9217 905.5858 914.7903 919.2243 928.4668 941.3301 955.4014 1033.2212 1057.6438 1060.8686 1082.8518 1115.6881 1131.2121 1151.5003 1161.2011 1177.8208 1199.7428 1202.2053 1203.7044 1228.8051 1252.0114 1265.5328 1276.7834 1321.5941 1324.1725 1348.5036 1351.3612 1375.2047 1385.5623 1390.2731 1398.6988 1422.6134 1426.2443 1453.4477 1466.4271 1467.0315 1479.9346 1481.4968 1494.1855 1537.4670 1578.6713 1611.3250 1617.2353 1662.8068 2971.3018 2974.8017 3007.0922 3030.0136 3062.6187 3073.9943 3077.2471 3082.0026 3106.0658 3116.6040 3143.4077 3159.6205 3169.5623 3174.5648 3504.4597 3588.6525
redmass: 2.6116 9.0181 4.8534 6.9407 11.2626 7.2119 8.1206 11.6139 12.2611 4.6606 4.1282 4.8896 6.4067 4.8262 7.1762 4.1677 1.2931 5.1176 1.1270 3.6508 3.9252 3.4640 1.1631 5.2992 6.8939 4.8929 3.2652 2.8940 2.9359 3.8082 6.9022 5.1610 6.1492 3.4965 3.4601 3.8647 3.1778 3.8627 2.9012 2.0759 8.5993 4.3130 3.2508 5.3116 5.9403 1.5345 5.1736 2.8222 3.4546 1.5650 5.2450 1.7947 1.5685 1.3403 1.1935 3.1900 2.0897 1.4319 4.0466 2.3018 2.0659 1.5151 2.6519 1.6949 1.2365 2.1845 1.2908 1.6823 1.6469 1.8285 4.6906 3.3506 1.5551 1.6544 1.2962 2.7901 1.5726 4.6959 1.1961 2.2396 1.8691 2.1454 3.2429 3.3384 1.1049 1.0494 1.0533 1.0517 1.2620 2.0016 7.8230 6.6376 6.8487 7.4080 8.6517 1.0350 1.0355 1.0650 1.0857 1.1000 1.0980 1.1004 1.0993 1.0965 1.0900 1.0906 1.0925 1.0929 1.0950 1.0639 1.0660
irintensity: 0.0767 0.7350 0.1322 0.9665 1.8687 0.9135 0.2873 0.8230 0.0402 1.1172 1.7237 0.9281 0.2801 0.2481 0.5940 2.2068 0.3989 0.7025 0.2361 2.2862 4.7552 7.9668 107.9752 4.1677 4.9591 0.1064 5.3426 4.7462 9.5647 3.6626 10.1769 0.1055 10.9755 19.4852 8.9347 44.1999 4.9030 0.6589 26.5698 138.6897 67.7952 17.1412 0.1667 1.3252 40.7064 43.8431 18.0762 16.1647 9.9852 13.6975 11.2868 4.9951 5.9551 0.0898 2.3579 28.7527 28.0360 0.1952 19.2826 77.5634 274.5077 8.3821 12.3799 262.7823 25.9482 20.6033 21.0349 10.4292 20.7210 0.4966 177.2615 1.6894 12.7866 88.5718 0.5116 58.6959 0.5667 18.9650 12.9579 53.0733 6.5227 23.7264 257.5147 25.4758 11.7469 0.2845 8.8654 15.7537 8.6156 126.6879 64.6283 19.8861 10.3997 7.1823 181.6887 27.5575 29.0616 8.6838 1.0548 2.0233 103.4546 21.4455 33.6000 4.0475 24.0366 5.1393 2.8358 1.2300 2.9950 27.9391 36.6775
temp: 298.150 k
press: 1.00000 atm
elementType: 53 53 8 8 8 8 6 6 6 6 6 6 6 6 6 6 6 6 6 6 6 6 6 1 1 1 1 1 1 1 1 1 1 1 1 1 1 1 1
symmnumber: 1
zpe: 754412.5 jmol-1
zpe.correction: 0.287341 hartree
zpe.thermalcorrener: 0.310700 hartree
zpe.thermalcorrenthalpy: 0.311645 hartree
zpe.thermalcorrgfe: 0.225633 hartree
zpe.sumelectzpe: -979.638058 hartree
zpe.sumelectthermal: -979.614698 hartree
zpe.sumelectthermalent: -979.613754 hartree
zpe.sumelectthermalfe: -979.699766 hartree
dipole: -0.4991 1.0705 1.1361
dipole: 1.6388
quadrupole: -132.3318 -168.0634 -159.4279
quadrupole: -6.5700 -11.6723 1.5676
quadrupole: 20.9425 -14.7891 -6.1535 -6.5700 -11.6723 1.5676
hfenergy: -979.9253986 hartree
pointgroup: C01 [X(C17H16I2O4)]
dipole: -0.2607299 0.337897 -0.4832942 debye
polarizability: 288.3883009|-21.3557002|193.956074|2.7370127|7.5881543|253.2709611 unknown
InChI: InChI=1S/C17H16I2O4/c1-9(2)12-8-11(3-4-15(12)20)23-17-13(18)5-10(6-14(17)19)7-16(21)22/h3-6,8-9,20-21H,7H2,1-2H3
charge 0 multiplicity 1
39 atoms
I  -0.306412 -1.517459 3.059423
I  -0.2146 -1.896116 -3.09046
O  0.748045 -2.067306 0.015444
O  5.24239 1.346606 0.01221
O  -5.520567 1.922222 -0.423756
O  -4.844621 1.262399 1.697861
C  2.681041 2.614135 -0.091907
C  2.837221 1.092771 -0.053295
C  2.094682 3.137081 1.248473
C  1.818939 3.078402 -1.294335
C  1.704328 0.242732 -0.049697
C  4.119504 0.485858 0.008431
C  1.854377 -1.155877 0.009829
C  4.263435 -0.921657 0.065963
C  3.127192 -1.753921 0.067278
C  -0.559521 -1.565807 -0.029303
C  -3.295815 -0.76232 -0.117849
C  -1.278281 -1.287132 1.16443
C  -1.24199 -1.441441 -1.266515
C  -2.628861 -0.887955 1.126495
C  -2.594955 -1.04317 -1.314061
C  -4.768359 -0.356944 -0.176776
C  -5.02803 0.986736 0.492782
H  3.691251 3.044926 -0.209349
H  1.083958 2.724516 1.428233
H  2.015938 4.240183 1.232055
H  2.734652 2.848026 2.101241
H  2.241916 2.721166 -2.250469
H  1.77203 4.182782 -1.327295
H  0.780998 2.702215 -1.221025
H  0.703213 0.684765 -0.093329
H  5.262983 -1.373423 0.11124
H  3.213334 -2.842789 0.112034
H  -3.164728 -0.662947 2.052785
H  -3.101934 -0.955525 -2.279342
H  -5.380083 -1.105856 0.361953
H  -5.119297 -0.313793 -1.218498
H  6.079267 0.82161 0.051489
H  -5.67774 2.790704 0.039109
