program: Gaussian 09
title: 000198521
version: EM64L-G09RevD.01
frameworkgroup: C1[X(C7H12Cl3N3O2)]
method: RPBEPBE
basis: SDD
operation: Freq
keyword: #p
keyword: freq=noraman
keyword: PBEPBE/SDD
title: #p freq=noraman PBEPBE/SDD
converged: YES YES NO NO
title: Mulliken charges:
elementType: Cl Cl Cl O O N N N C C C C C C C H H H H H H H H H H H H
charge: -0.046298 -0.031137 -0.043788 -0.265616 -0.224899 -0.117960 -0.200990 0.063469 -0.358251 -0.317846 0.355396 -0.334580 -0.574374 -0.604563 -0.566742 0.257148 0.277455 0.238952 0.294467 0.266167 0.286765 0.281815 0.264119 0.283721 0.258855 0.281567 0.277148
chargesum: 0.00000
title: Mulliken charges with hydrogens summed into heavy atoms:
elementType: Cl Cl Cl O O N N N C C C C C C C
charge: -0.046298 -0.031137 -0.043788 -0.265616 -0.224899 -0.117960 -0.200990 0.063469 0.176351 0.215573 0.355396 0.218352 -0.028440 -0.061987 -0.008027
polarizability: 1.62808410e+02 -5.14127309e+00 1.15537659e+02 -7.09098022e+00 -1.03255075e+01 1.18364566e+02
1716.lowfreq: -13.3831 -7.3290 -0.0011 -0.0010 -0.0004 3.2379 17.9913 24.5827 32.4791
frequency: 17.7808 24.5214 32.3467 37.8586 45.2362 62.9930 66.7274 87.8995 120.6244 158.9964 187.0838 195.6802 244.8614 272.5146 287.9722 309.4598 351.8201 369.2087 393.4234 427.2228 463.6737 495.5000 540.8933 602.0066 616.8004 651.7206 687.0952 706.6544 751.9388 798.3886 820.0792 879.1128 892.9355 925.4817 937.7884 990.5875 1024.0708 1037.3416 1050.5407 1060.4384 1118.3643 1130.3695 1184.2443 1207.1229 1233.7099 1239.4872 1245.0508 1263.0099 1287.7829 1297.3903 1310.1747 1345.3530 1345.5696 1354.5829 1371.7655 1405.0596 1445.6980 1450.0842 1452.8474 1459.3887 1478.0384 1479.9254 1606.7220 2956.3002 2993.5900 3043.0136 3054.4711 3057.8676 3070.0728 3091.3809 3122.2947 3130.2025 3132.0322 3147.4641 3158.2235
redmass: 9.7905 8.8213 8.2100 9.8207 7.1752 3.0284 11.6392 8.2226 7.6232 6.5891 3.0263 6.2647 6.1314 3.6048 4.9443 3.1746 2.9361 2.3334 7.1490 5.2508 6.0795 3.6089 4.3421 5.5980 4.9016 3.0349 7.5108 7.6379 1.6975 2.3155 3.4846 1.7893 2.0813 2.4181 2.1578 1.6622 2.4201 1.5277 3.3005 2.6994 1.5378 1.7816 1.5291 1.4565 1.1944 1.9807 2.6806 1.1728 1.2792 1.1905 1.2313 1.3705 1.2683 2.2957 2.5043 2.3232 1.0960 1.0920 1.1038 1.1003 1.0895 1.0833 10.1763 1.0706 1.0725 1.0610 1.0593 1.0578 1.0560 1.0901 1.1030 1.1034 1.1081 1.0951 1.1122
irintensity: 0.9350 1.7703 1.6985 1.4579 2.7580 0.5457 1.2785 1.0510 7.7140 5.2605 0.6873 2.7390 1.1939 8.6548 13.6042 0.2414 5.1818 4.6849 7.6323 9.7447 13.3164 25.2835 19.4551 23.7254 16.6593 6.2165 38.6590 27.6973 3.5413 100.4961 40.7153 30.5638 32.8121 51.4300 39.1203 10.8223 49.9536 14.8791 11.4286 19.3846 35.3163 25.1606 33.7163 46.7224 10.3134 87.7963 15.5842 6.9331 11.3397 43.3758 25.2680 5.7530 13.2300 162.7344 43.1019 95.9290 14.4974 23.7187 8.6498 29.7690 0.3361 41.2798 277.8716 27.9702 17.5668 2.6424 21.5735 32.6450 11.6134 2.4746 2.5845 5.8323 13.3353 6.6864 2.5608
temp: 298.150 k
press: 1.00000 atm
elementType: 17 17 17 8 8 7 7 7 6 6 6 6 6 6 6 1 1 1 1 1 1 1 1 1 1 1 1
symmnumber: 1
zpe: 522145.6 jmol-1
zpe.correction: 0.198875 hartree
zpe.thermalcorrener: 0.216225 hartree
zpe.thermalcorrenthalpy: 0.217170 hartree
zpe.thermalcorrgfe: 0.148517 hartree
zpe.sumelectzpe: -1967.580229 hartree
zpe.sumelectthermal: -1967.562879 hartree
zpe.sumelectthermalent: -1967.561934 hartree
zpe.sumelectthermalfe: -1967.630587 hartree
dipole: -4.8757 4.0638 0.6063
dipole: 6.3761
quadrupole: -113.7546 -115.2526 -115.5222
quadrupole: -11.5648 2.6406 5.1026
quadrupole: 1.0886 -0.4095 -0.6791 -11.5648 2.6406 5.1026
hfenergy: -1967.7791039 hartree
pointgroup: C01 [X(C7H12Cl3N3O2)]
dipole: 2.1457246 -1.1650789 0.5755413 debye
polarizability: 161.84071|3.6296274|118.1301649|8.6001195|11.8904518|116.7397596 unknown
InChI: InChI=1S/C7H12Cl3N3O2/c8-1-4-12(5-2-9)7(14)13(11-15)6-3-10/h1-6H2
charge 0 multiplicity 1
27 atoms
Cl 0.231935 -3.030246 0.598453
Cl 3.582679 2.183228 0.170545
Cl -4.810261 -0.930954 -0.880398
O  -0.022957 0.458394 -2.027106
O  -2.002822 1.728942 1.811002
N  1.233886 -0.012667 -0.115953
N  -1.104194 0.662039 0.036231
N  -0.916026 1.362605 1.255396
C  1.324837 -0.513337 1.267729
C  2.434853 -0.127117 -0.977264
C  0.068527 0.358709 -0.770684
C  -2.453807 0.51174 -0.565643
C  1.627158 -2.013173 1.367797
C  3.727194 0.374843 -0.334334
C  -3.115911 -0.783226 -0.068138
H  2.119411 0.040703 1.806781
H  0.394471 -0.287115 1.801268
H  2.591549 -1.185114 -1.281415
H  2.222333 0.43302 -1.901176
H  -3.059566 1.38364 -0.264332
H  -2.329552 0.502711 -1.658598
H  1.676457 -2.324186 2.422356
H  2.538606 -2.327975 0.837963
H  4.547392 0.32672 -1.066132
H  4.017328 -0.163645 0.580821
H  -3.302147 -0.769365 1.015026
H  -2.555871 -1.681575 -0.364192
