program: Gaussian 09
title: 000198589
version: EM64L-G09RevD.01
frameworkgroup: C1[X(C13H10N4O2S3)]
method: RPBEPBE
basis: SDD
operation: Freq
keyword: #p
keyword: freq=noraman
keyword: PBEPBE/SDD
title: #p freq=noraman PBEPBE/SDD
converged: YES YES NO NO
title: Mulliken charges:
elementType: S S S O O N N N N C C C C C C C C C C C C C H H H H H H H H H H
charge: 0.303221 0.273279 0.236427 -0.096219 -0.258177 0.103552 -0.029831 0.004415 -0.564534 -0.350645 0.354281 -0.274454 -0.334310 -0.565662 -0.234129 -0.212531 0.351140 0.080156 -0.141122 -0.625900 -0.197432 -0.480827 0.245877 0.259372 0.230432 0.232354 0.306560 0.330936 0.343699 0.225960 0.241579 0.242530
chargesum: 0.00000
title: Mulliken charges with hydrogens summed into heavy atoms:
elementType: S S S O O N N N N C C C C C C C C C C C C C
charge: 0.303221 0.273279 0.236427 -0.096219 -0.258177 0.103552 -0.029831 0.004415 0.110102 -0.350645 0.354281 -0.028577 -0.074938 -0.565662 -0.003696 0.019823 0.351140 0.080156 -0.141122 -0.319340 -0.197432 0.229242
polarizability: 3.66896946e+02 2.80833089e+01 2.45189785e+02 1.23886919e+01 -1.27684164e+01 1.47561732e+02
1716.lowfreq: -8.3234 -4.9788 -0.0019 -0.0009 -0.0006 0.8215 8.4705 17.9202 24.1780
frequency: 8.2356 17.5314 24.1767 26.4360 40.2278 78.5445 100.2837 105.0985 124.1324 138.2822 170.6920 188.6825 191.6139 196.2915 246.2173 253.8825 255.6225 290.4255 303.8470 324.5077 358.5692 367.4417 368.9298 389.5713 431.7127 433.7515 466.9729 488.6021 498.1863 521.9129 545.1795 556.1454 563.1051 570.2816 591.5684 605.3587 611.3370 631.5354 679.3574 699.3926 734.7648 735.4109 770.0533 772.9905 804.3709 831.6178 865.9847 878.6510 885.5206 905.7376 951.8713 965.8050 987.4021 1014.9319 1043.8663 1052.7727 1100.2148 1112.9721 1118.8309 1155.3863 1168.9684 1208.5841 1222.1874 1254.9493 1272.8279 1298.9971 1374.1455 1420.3368 1425.2456 1443.5719 1448.2527 1463.6455 1467.2910 1469.9818 1523.8402 1562.6912 1591.0258 1603.0862 1641.8671 1664.3381 3000.6746 3112.0467 3135.5440 3136.8311 3150.7471 3165.1833 3176.3726 3282.6337 3557.5733 3709.2173
redmass: 7.1113 7.8420 7.9095 8.3710 6.4969 4.9366 2.0039 4.6575 2.5993 4.8380 5.9196 5.0686 5.7593 10.4282 5.8291 7.5548 6.1103 1.1401 7.1721 4.6677 13.5402 5.3890 8.7337 10.4800 2.1823 1.6005 7.7017 8.9899 7.9697 6.9134 6.6206 6.9131 7.9406 4.9055 5.5798 9.4027 9.5520 9.6014 7.1528 3.3004 2.5864 2.4904 1.6261 2.9706 5.9372 6.9196 1.3893 7.5323 9.2033 7.0932 1.3832 6.4302 1.3209 2.1643 5.6818 2.8918 1.5403 1.2525 1.5666 1.4511 1.1424 4.1622 2.7498 2.7893 1.5937 8.5928 4.7037 1.1483 2.9416 2.5647 1.0536 8.1768 10.6918 1.0599 10.1659 6.1553 1.4896 7.0499 3.2789 12.8780 1.0282 1.1061 1.0858 1.1045 1.0904 1.0960 1.0993 1.0957 1.0454 1.1045
irintensity: 0.0834 0.8677 0.9038 0.3470 3.4860 4.2341 0.8166 1.0655 1.5351 1.7706 0.6931 1.5677 1.7186 2.0297 3.8152 1.1279 1.9729 76.1436 0.4725 19.0651 3.6133 5.2194 1.8751 19.7352 73.6902 173.7153 33.2265 1.5757 10.2919 39.6180 9.8891 19.4348 14.4068 23.6094 14.3423 7.1700 22.8779 84.2508 6.3342 27.3999 160.0456 20.8713 68.7206 124.6707 35.8768 0.1881 0.8905 76.7327 57.5389 24.9276 2.6213 281.9133 0.0482 6.6760 8.7592 44.6068 50.8425 0.2050 2.7223 7.8893 0.8641 31.4455 2.0969 83.8480 0.0820 43.0951 16.7729 1.3000 40.0962 4.9168 15.0660 16.2577 56.0240 27.9291 31.3862 1.4130 18.9422 8.5357 578.1688 134.1885 70.3203 27.2031 2.3064 14.2542 9.8968 17.4355 21.0148 8.0170 118.0171 53.8576
temp: 298.150 k
press: 1.00000 atm
elementType: 16 16 16 8 8 7 7 7 7 6 6 6 6 6 6 6 6 6 6 6 6 6 1 1 1 1 1 1 1 1 1 1
symmnumber: 1
zpe: 556894.3 jmol-1
zpe.correction: 0.212110 hartree
zpe.thermalcorrener: 0.233649 hartree
zpe.thermalcorrenthalpy: 0.234593 hartree
zpe.thermalcorrgfe: 0.156952 hartree
zpe.sumelectzpe: -2063.387127 hartree
zpe.sumelectthermal: -2063.365588 hartree
zpe.sumelectthermalent: -2063.364644 hartree
zpe.sumelectthermalfe: -2063.442286 hartree
dipole: 3.1572 -2.0334 0.8487
dipole: 3.8501
quadrupole: -111.4160 -117.0506 -149.2648
quadrupole: 6.2045 1.9917 -4.7376
quadrupole: 14.4944 8.8599 -23.3543 6.2045 1.9917 -4.7376
hfenergy: -2063.5992372 hartree
pointgroup: C01 [X(C13H10N4O2S3)]
dipole: 0.6857929 1.0873553 0.8011125 debye
polarizability: 358.8965519|45.4039129|204.2699893|5.6177233|51.9229044|196.4819227 unknown
InChI: InChI=1S/C13H10N4O2S3/c1-19-17-10(8-6-20-12(14)15-8)11(18)22-13-16-7-4-2-3-5-9(7)21-13/h2-6H,14H2,1H3
charge 0 multiplicity 1
32 atoms
S  -2.632849 1.034953 -1.463324
S  0.370832 0.110081 -1.804776
S  4.157121 2.907727 3.133678
O  0.086565 0.277884 0.962143
O  4.446756 0.654256 -0.780086
N  -1.816283 -1.529315 -1.290143
N  1.777963 2.358066 2.00559
N  3.049781 0.344679 -0.873113
N  1.599846 3.835853 3.876858
C  -3.853686 -0.259839 -1.144086
C  -3.210897 -1.543604 -1.089351
C  -5.245225 -0.129233 -0.960899
C  -3.980596 -2.706808 -0.846893
C  -1.359285 -0.316502 -1.492597
C  -5.995996 -1.300783 -0.719666
C  -5.369664 -2.576959 -0.66302
C  2.75607 1.649975 1.273986
C  2.326133 0.829478 0.132644
C  0.878009 0.420469 0.022241
C  4.071779 1.825434 1.704547
C  2.300951 3.054086 2.992855
C  5.118175 0.115015 -1.984921
H  -5.736814 0.847371 -1.001427
H  -3.479415 -3.678203 -0.805246
H  -7.078759 -1.222131 -0.573339
H  -5.977652 -3.467694 -0.473036
H  4.976816 1.398101 1.28789
H  2.058603 4.367082 4.609953
H  0.585687 3.859448 3.792141
H  6.178787 0.379969 -1.854238
H  4.705179 0.587119 -2.891636
H  4.988271 -0.978875 -2.031725
