program: Gaussian 09
title: 000198628
version: EM64L-G09RevD.01
frameworkgroup: C1[X(C13H17NO4S)]
method: RPBEPBE
basis: SDD
operation: Freq
keyword: #p
keyword: freq=noraman
keyword: PBEPBE/SDD
title: #p freq=noraman PBEPBE/SDD
converged: YES YES NO NO
title: Mulliken charges:
elementType: S O O O O N C C C C C C C C C C C C C H H H H H H H H H H H H H H H H H
charge: 0.504623 -0.278586 -0.293065 -0.240011 -0.424918 -0.537994 0.345744 -0.592253 0.273925 0.120069 -0.734481 -0.703158 -0.423212 0.267559 -0.218353 -0.361732 0.376206 -0.552460 -0.487246 0.235355 0.240530 0.232665 0.208650 0.235009 0.202816 0.236364 0.246182 0.240265 0.226587 0.250570 0.223698 0.244634 0.259092 0.217299 0.241026 0.218601
chargesum: 0.00000
title: Mulliken charges with hydrogens summed into heavy atoms:
elementType: S O O O O N C C C C C C C C C C C C C
charge: 0.504623 -0.278586 -0.293065 -0.240011 -0.424918 -0.537994 0.345744 -0.116368 0.273925 0.120069 -0.058158 -0.017795 -0.182948 0.267559 0.008234 -0.111162 0.376206 0.174964 0.189680
polarizability: 2.10955818e+02 -1.10907214e+01 1.95889725e+02 5.90405069e+00 -1.44297510e-01 1.39485432e+02
1716.lowfreq: -8.5761 -0.2914 -0.0015 -0.0011 0.0010 6.0919 18.3206 28.9442 46.9813
frequency: 17.9863 28.7908 46.9499 51.0365 54.9894 81.8728 94.2175 127.3754 134.0755 156.0550 164.4456 187.9854 194.2826 216.7231 221.9109 247.0515 275.7647 294.9775 304.7443 318.2009 329.8346 361.8874 377.9161 400.1363 431.0731 461.9047 485.2429 514.5714 525.4072 538.8326 544.6438 579.1856 616.8929 687.8192 702.1687 724.9054 728.6369 735.6262 775.0049 822.5684 847.0455 886.6606 901.1513 912.7313 927.0612 936.6077 954.0439 966.6625 989.3335 1006.0141 1051.0027 1075.4776 1097.4685 1100.5331 1110.0062 1116.7336 1130.7545 1164.1745 1167.9909 1188.1585 1220.6502 1239.3649 1251.1706 1266.9264 1270.6157 1295.2670 1379.7622 1393.6258 1399.6505 1410.2848 1423.2412 1444.2058 1448.6299 1453.6126 1458.3647 1462.6431 1464.0598 1465.2271 1468.7491 1469.5630 1480.3131 1484.2457 1602.7304 1620.7525 1636.9531 2958.9089 2985.1697 2986.2672 2991.1152 2994.9883 3050.8688 3056.5613 3082.3277 3086.4395 3088.1064 3092.1940 3097.5461 3102.6116 3128.9040 3135.1066 3153.1677 3173.0550
redmass: 5.1373 4.1554 4.1798 4.0446 3.6649 5.2349 3.4805 3.0967 1.7142 1.3632 5.1750 1.6119 1.1675 2.8338 3.0471 1.2921 3.7603 4.1025 2.8431 2.8921 3.6123 4.7188 3.4387 6.7051 2.7909 9.9898 3.2706 4.9055 4.7091 4.1494 8.3050 6.3130 5.9907 8.5859 7.2298 6.2720 4.0721 3.8752 1.6384 3.4089 5.5817 1.6249 3.1999 1.6844 8.4743 1.3759 1.3524 1.7729 3.8655 1.4245 2.0140 6.8641 1.2574 1.5484 1.3071 1.3578 1.8121 1.4024 1.5888 2.9146 1.6867 2.3452 2.8180 3.7540 3.2624 2.2467 1.2540 1.3464 3.9721 1.1214 1.1589 1.0590 1.0807 2.2565 1.0486 1.2237 1.1541 2.5053 1.0656 1.1231 1.0530 1.0564 7.7929 8.7883 10.4078 1.0288 1.0513 1.0434 1.0399 1.0344 1.0999 1.1048 1.0991 1.1008 1.0990 1.1017 1.1006 1.0998 1.1019 1.0877 1.0918 1.0985
irintensity: 0.3038 1.5129 1.0549 4.2330 1.1448 1.1684 5.1173 0.0644 0.4130 0.3523 2.6026 1.1111 0.4236 2.7086 0.8647 1.0334 4.3755 7.2755 0.9138 1.2933 10.1737 8.2041 8.9507 6.1650 1.1084 57.8080 1.9461 8.1113 0.5543 5.8967 35.9693 3.9099 0.7030 12.6779 10.5057 5.6802 31.5707 36.2006 36.9812 2.6592 60.8730 5.6953 26.4254 2.0870 71.5046 1.0885 0.9987 5.1606 24.7799 1.2666 32.3795 239.9510 3.6745 91.4465 24.0970 13.5064 117.0666 87.7254 5.6806 65.3178 126.8230 50.5335 155.4370 309.8265 31.8891 57.8182 32.8221 10.3911 29.2896 1.1214 38.4696 14.3316 4.9386 65.8713 24.1680 18.7403 29.1010 23.6504 6.1501 11.9042 18.0588 15.4219 17.0348 17.8940 247.6233 63.3098 22.2476 10.2871 35.4159 33.3671 13.7313 52.7787 8.1372 25.6869 37.5602 13.1731 15.3057 29.8770 9.0461 4.0600 16.5886 14.2363
temp: 298.150 k
press: 1.00000 atm
elementType: 16 8 8 8 8 7 6 6 6 6 6 6 6 6 6 6 6 6 6 1 1 1 1 1 1 1 1 1 1 1 1 1 1 1 1 1
symmnumber: 1
zpe: 734311.2 jmol-1
zpe.correction: 0.279684 hartree
zpe.thermalcorrener: 0.300186 hartree
zpe.thermalcorrenthalpy: 0.301130 hartree
zpe.thermalcorrgfe: 0.228781 hartree
zpe.sumelectzpe: -1257.804568 hartree
zpe.sumelectthermal: -1257.784067 hartree
zpe.sumelectthermalent: -1257.783123 hartree
zpe.sumelectthermalfe: -1257.855472 hartree
dipole: 0.1298 2.3240 0.7047
dipole: 2.4320
quadrupole: -90.1313 -106.4879 -126.0642
quadrupole: -2.2557 -6.9664 0.1365
quadrupole: 17.4298 1.0733 -18.5031 -2.2557 -6.9664 0.1365
hfenergy: -1258.0842527 hartree
pointgroup: C01 [X(C13H17N1O4S1)]
dipole: -0.1316369 -0.8785233 0.3554731 debye
polarizability: 206.6847261|-13.2322691|198.6009845|-10.7513393|-2.3484716|141.0452652 unknown
InChI: InChI=1S/C13H17NO4S/c1-13(2)8-9-6-5-7-10(11(9)18-13)17-12(15)14(3)19-16-4/h5-7H,8H2,1-4H3
charge 0 multiplicity 1
36 atoms
S  3.704115 0.24181 -0.966433
O  -1.113474 -0.929017 0.005839
O  1.011125 1.116894 -0.316875
O  0.987905 0.389008 1.927942
O  3.277522 -1.324273 -1.818872
N  2.902425 0.140115 0.60756
C  -2.457387 -1.58013 0.379642
C  -3.533904 -0.526271 -0.053604
C  -2.7382 0.764704 -0.184381
C  -1.363397 0.433024 -0.151626
C  -2.518742 -2.897794 -0.396616
C  -2.420249 -1.777461 1.904594
C  -3.144106 2.096452 -0.372525
C  -0.38005 1.430921 -0.28405
C  -2.153505 3.101847 -0.524821
C  -0.779717 2.768523 -0.480363
C  1.567926 0.524295 0.827962
C  3.599443 -0.473313 1.765985
C  4.087825 -2.485082 -1.39414
H  -4.343256 -0.457653 0.694901
H  -3.992276 -0.806521 -1.021826
H  -1.684653 -3.558975 -0.104565
H  -3.469176 -3.421997 -0.186625
H  -2.450277 -2.713515 -1.482507
H  -3.339984 -2.285719 2.249602
H  -1.548395 -2.389991 2.189758
H  -2.337158 -0.805236 2.421091
H  -4.207333 2.358241 -0.405807
H  -2.449237 4.145192 -0.673432
H  -0.005992 3.53438 -0.592237
H  4.664003 -0.58041 1.509496
H  3.168301 -1.461029 2.009461
H  3.491595 0.173992 2.652342
H  5.173303 -2.278017 -1.455078
H  3.818411 -3.280972 -2.109573
H  3.823966 -2.80912 -0.36922
