program: Gaussian 09
title: 000198469
version: EM64L-G09RevD.01
frameworkgroup: C1[X(C8H8N2OS)]
method: RPBEPBE
basis: SDD
operation: Freq
keyword: #p
keyword: freq=noraman
keyword: PBEPBE/SDD
title: #p freq=noraman PBEPBE/SDD
converged: YES YES NO NO
title: Mulliken charges:
elementType: S O N N C C C C C C C C H H H H H H H H
charge: 0.327879 -0.265879 -0.410679 -0.705452 0.372944 -0.583595 0.585642 0.159413 -0.425974 -0.412958 -0.186460 -0.506483 0.262891 0.218775 0.223459 0.317252 0.312670 0.242641 0.231257 0.242657
chargesum: 0.00000
title: Mulliken charges with hydrogens summed into heavy atoms:
elementType: S O N N C C C C C C C C
charge: 0.327879 -0.265879 -0.410679 -0.075531 0.372944 -0.583595 0.585642 0.159413 -0.163083 -0.194183 0.036999 0.210073
polarizability: 1.66460901e+02 1.46415574e+00 1.42424382e+02 -7.41893101e-03 1.42053080e-02 5.22156039e+01
1716.lowfreq: -0.0018 -0.0017 0.0011 3.9888 8.8970 11.4258 78.0504 120.5793 153.8879
frequency: 78.0415 120.5720 153.8875 167.3505 197.2893 246.1053 251.2910 274.1078 319.9878 321.7526 383.7681 429.6013 478.1883 483.2115 511.9420 547.9133 549.7215 618.6666 663.0079 699.1387 713.1700 775.6778 793.7744 875.8099 887.2037 966.2612 973.1523 1016.7784 1061.0523 1089.7259 1115.9693 1155.8010 1168.4868 1204.3399 1311.6593 1357.6913 1401.8915 1414.7180 1424.9047 1449.2926 1462.4091 1465.9312 1493.7977 1592.3633 1609.9283 1647.8467 2996.7490 3095.8813 3123.4683 3144.0660 3148.9990 3177.6538 3566.7825 3705.9266
redmass: 3.7961 3.3685 3.8723 1.1561 5.0101 3.7756 4.8504 3.0026 1.4356 4.2269 1.1972 7.9585 5.2875 4.8813 6.6521 7.9012 4.6288 7.5266 5.4853 8.2717 2.4575 6.9914 1.8671 1.4452 6.2966 1.3226 3.1263 4.8540 2.5105 1.5801 1.2559 1.4050 1.3183 2.1739 1.9471 2.9683 5.7686 4.1550 2.5264 1.0497 2.1214 1.0578 4.1927 7.0893 5.1795 1.2388 1.0295 1.1045 1.0877 1.1047 1.0922 1.0972 1.0454 1.1040
irintensity: 10.6240 0.2711 5.8948 0.2139 0.8542 16.2696 6.8019 10.6817 113.9707 1.2518 178.4355 0.7989 4.6750 2.3902 1.4961 1.7468 0.9421 10.2204 4.3464 11.2642 25.9389 7.7470 71.0459 0.3513 4.7382 1.3572 33.7346 27.6292 38.2441 14.5935 0.0894 5.5080 9.4733 15.2970 17.5547 250.4748 3.3546 27.3353 5.6665 13.6493 82.7367 11.5086 140.8964 15.4248 52.2474 238.3566 45.4159 28.0143 15.3581 21.6901 20.0154 7.5088 66.8368 23.4139
temp: 298.150 k
press: 1.00000 atm
elementType: 16 8 7 7 6 6 6 6 6 6 6 6 1 1 1 1 1 1 1 1
symmnumber: 1
zpe: 388096.7 jmol-1
zpe.correction: 0.147818 hartree
zpe.thermalcorrener: 0.158944 hartree
zpe.thermalcorrenthalpy: 0.159888 hartree
zpe.thermalcorrgfe: 0.111252 hartree
zpe.sumelectzpe: -891.558471 hartree
zpe.sumelectthermal: -891.547345 hartree
zpe.sumelectthermalent: -891.546401 hartree
zpe.sumelectthermalfe: -891.595037 hartree
dipole: -2.2282 0.2530 0.0000
dipole: 2.2425
quadrupole: -53.1553 -74.4462 -81.8763
quadrupole: 5.7757 -0.0144 0.0167
quadrupole: 16.6707 -4.6203 -12.0504 5.7757 -0.0144 0.0167
hfenergy: -891.706289 hartree
pointgroup: C01 [X(C8H8N2O1S1)]
dipole: 0.8809888 -0.0467027 -0.0083606 debye
dipolederiv: -0.2713937 -0.1672322 0.0056519 0.0651092 -0.2206768 0.0028774 0.0031675 0.0053283 0.1037032 -1.4646203 -0.3405335 0.015594 -0.5493462 -0.5754594 0.0085579 0.0182626 0.0068619 -0.2796153 -0.0948315 0.4897372 -0.0075213 -0.1417523 -0.356003 0.0021594 -0.0006638 -0.0042385 -0.311774 -0.7293738 -0.6195084 0.0104612 -0.7525725 -0.8384211 0.0071109 0.0123761 0.006396 -0.728789 -0.383777 -0.0922693 0.00572 0.0020887 0.0954969 -0.0002894 0.0048165 0.0006961 0.0923734 -0.1612641 -0.6950195 0.0076933 -0.2270626 0.2819302 -0.002576 0.0014564 0.0008592 -0.1949744 0.6693591 0.8369836 -0.0158815 1.0136978 0.6804711 -0.0160476 -0.0180238 -0.014191 0.1950037 1.2586415 0.3448304 -0.0148114 0.8115088 0.5649902 -0.0128082 -0.020196 -0.008386 0.1463237 -0.1064165 0.116359 -0.0020987 -0.0576658 -0.1992125 0.0005946 -0.0001737 -0.0011239 -0.2025732 -0.0243 0.1328704 -0.0040849 -0.4192053 -0.1603502 0.003579 0.0032862 -0.0012036 -0.2395681 0.1752712 -0.1484979 -0.0014892 0.1188394 0.1168666 -0.004395 -0.004558 -0.0015587 -0.1370778 0.8676018 0.1062998 -0.0071513 -0.1171746 0.2134632 0.0020109 -0.004643 -0.0002382 0.2817412 0.0441272 -0.075278 0.0022118 -0.0459735 0.0128615 0.0023605 0.0017408 0.0027629 0.1805556 -0.1502159 0.0266084 0.0031658 0.012675 0.0745366 0.000935 0.0035076 0.0007798 0.1697934 0.0524248 0.0815742 0.0000999 0.0862089 -0.1013461 0.0021684 -0.0001452 0.0021566 0.1566555 0.1832125 0.069477 0.0001787 0.0737465 0.1969391 0.0020324 0.0006491 0.00271 0.381646 0.1915489 0.0540246 0.0003374 0.0536479 0.1568342 0.0031244 -0.0006813 0.0018191 0.3857127 -0.0068333 -0.0207081 -0.0050517 0.115103 0.0483509 -0.1023776 0.0372219 -0.0794496 -0.058802 -0.0418222 -0.0807106 0.0024939 -0.1582072 -0.0434115 0.0033045 0.0033521 0.0025458 0.1214742 -0.0073386 -0.0190071 0.0044821 0.1163347 0.0521402 0.0976786 -0.040752 0.0774738 -0.0618087 unknown
polarizability: 166.1865436|2.8839298|142.6747801|-1.1743018|-1.0651913|52.2395631 unknown
InChI: InChI=1S/C8H8N2OS/c1-11-8-5-3-2-4-6(9)7(5)12-10-8/h2-4H,9H2,1H3
charge 0 multiplicity 1
20 atoms
S  -0.215568 2.265758 -0.04373
O  -2.592479 -0.853257 0.013683
N  -1.818492 1.388327 -0.018498
N  2.999118 1.590244 -0.071134
C  -0.18786 -0.403445 -0.015173
C  0.71084 0.694814 -0.036206
C  2.119933 0.508589 -0.04887
C  -1.569102 0.072104 -0.007182
C  0.288961 -1.737572 -0.004234
C  2.584022 -0.836589 -0.037913
C  1.683502 -1.931654 -0.015684
C  -3.964966 -0.299805 0.021728
H  -0.415865 -2.572757 0.012281
H  3.664788 -1.023951 -0.047486
H  2.090407 -2.948698 -0.007768
H  2.662192 2.548486 -0.083707
H  4.002916 1.436592 -0.073933
H  -4.118171 0.329515 0.915392
H  -4.620213 -1.182168 0.037621
H  -4.136165 0.310664 -0.881683
